{"text_format":"1","workbook":"xlsx","n_sheets":10,"sheets":["HOME","Data","Figures","B&R","C&J","CB&P","B&R Type Curve","Confined","Perched","Flowchart"],"not_rendered":{"charts":18,"images":9,"macros":1,"external_links":0,"defined_names":119,"comments":2,"pivot_tables":0},"unopened":[],"bounds":{"document_bytes":16777216,"sheet_cells":100000,"rows_first":2000,"rows_last":500,"rows_between":2000,"halvings":0,"cell_chars":16384,"cell_head_chars":4096},"cells_cut":0,"cells_raw":0,"read":"whole","date_system":"1900"}

{"sheet":"HOME","index":0,"n_rows":21,"n_cols":9,"rows_kept":21,"cut":false,"hidden":false,"merged":[[11,1,11,4],[3,1,3,4],[5,6,5,10],[10,1,10,4]]}
[null,null,null,null,null,"API LNAPL Transmissivity Workbook"]
[null,null,null,null,null,"Calculation of LNAPL Transmissivity from Baildown Test Data"]
[]
[null,"STEP 1: RESET OUTPUT SUMMARY"]
[]
[null,null,null,null,null,null,"STEP 4: LNAPL TRANSMISSIVITY SUMMARY"]
[]
[]
[]
[]
[null,"STEP 2: ENTER DATA & VIEW FIGURES"]
[null,"STEP 3: CHOOSE WELL CONDITIONS",null,null,null,null,null,null,"Mean LNAPL Transmissivity (ft2/d)"]
[null,null,null,null,null,null,null,null,2.9922458337886781]
[]
[]
[null,null,null,null,null,null,null,null,"Standard Deviation (ft2/d)"]
[null,null,null,null,null,null,null,null,0.48270293551829135]
[]
[]
[null,null,null,null,null,null,null,null,"Coefficient of Variation"]
[null,null,null,null,null,null,null,null,0.16131794054738799]

{"sheet":"Data","index":1,"n_rows":84,"n_cols":22,"rows_kept":84,"cut":false,"hidden":false,"merged":[]}
["Well Designation:","MW16"]
["Date:","2021-11-09"," "," "]
[]
["Ground Surface Elev (ft msl)",100.5,"Enter These Data",null,"Drawdown"]
["Top of Casing Elev (ft msl)",100.31,null,null,"Adjustment"]
["Well Casing Radius, rc (ft):",8.3000000000000004E-2,"re1",null,"(ft)"]
["Well Radius, rw (ft):",0.16700000000000001,null,null,{"$f":"Figures!C28","v":0}]
["LNAPL Specific Yield, Sy:",0.17499999999999999]
["LNAPL Density Ratio, rr:",0.78]
["Top of Screen (ft bgs):",30.7]
["Bottom of Screen (ft bgs):",40.700000000000003]
["LNAPL Baildown Vol. (gal.):",0.48]
["Effective Radius, re3 (ft):",{"$f":"SQRT(B8*(B7^2-B6^2)+B6^2)","v":0.10278132126023679},"Calculated Parameters"]
["Effective Radius, re2 (ft):",{"$f":"SQRT(-Figures!U27*B6^2+(Figures!U27+1)*B13^2)","v":{"$error":"#DIV/0!"}}]
["Initial Casing LNAPL Vol. (gal.):",{"$f":"PI()*B6^2*(F22-E22)*7.48","v":0.22178298401714927}]
["Initial Filter LNAPL Vol. (gal.):",{"$f":"IF(E22<B10,PI()*(B7^2-B6^2)*B8*(F22-B10)*7.48,PI()*(B7^2-B6^2)*B8*(F22-E22)*7.48)","v":0.11831215942270627}]
["Expected Thickness Recharged from Filter Pack (ft)",{"$f":"MAX(0,IFERROR(O22*(SUM(B15:B16)-B12)/SUM(B15:B16),O22))","v":0}]
[]
[null,null,"Enter Data Here",null,null,null,null,null,"Water Table","LNAPL",null,null,"LNAPL",null,null,null,null,null,null,null,"LNAPL","Ave."]
[null,null,null,null,null,null,null,null,"Depth","Drawdown",null,"Average ","Discharge","sn","bn","re",null,null,"DTP","DTW","Volume","re"]
[null,"Time (min)","DTP (ft btoc)","DTW (ft btoc)","DTP (ft bgs)","DTW (ft bgs)",null,null,"(ft)","sn (ft)",null,"Time (min)","Qn (ft3/d)","(ft)","(ft)","(ft)",null,null,"(ft bgs)","(ft bgs)","(gallons)","(ft)"]
["Initial Fluid Levels:",0,34.93,36.299999999999997,{"$f":"C22+B4-B5","v":35.120000000000005},{"$f":"D22+B4-B5","v":36.490000000000009},null,null,{"$f":"E22+(1-B$9)*(F22-E22)","v":35.421400000000006},null,null,null,null,null,{"$f":"F22-E22","v":1.3700000000000045}]
[]
["Enter Test Data:",1,36.33,36.35,{"$f":"IF(B24>0,C24+B$4-B$5,NA())","v":36.519999999999982},{"$f":"IF(B24>0,D24+B$4-B$5,NA())","v":36.539999999999992},null,null,{"$f":"E24+(1-B$9)*(F24-E24)","v":36.524399999999986},{"$f":"E24-E$22-E$7","v":1.3999999999999773},null,null,null,null,{"$f":"F24-E24","v":2.0000000000010232E-2},null,null,null,null,null,0,{"$f":"MAX(V25:V82)/(MAX(L25:L82)-L25)","v":0.10278132126023677}]
[null,3,35.950000000000003,35.97,{"$f":"IF(B25>0,C25+B$4-B$5,NA())","v":36.139999999999986},{"$f":"IF(B25>0,D25+B$4-B$5,NA())","v":36.159999999999997},null,null,{"$f":"E25+(1-B$9)*(F25-E25)","v":36.14439999999999},1.0199999999999818,null,{"$f":"IF(B25>0,0.5*(B24+B25),0)","v":2},{"$f":"IF(B25>0,1440*PI()*P25^2*(E24-E25+F25-F24)/(B25-B24),NA())","v":0},{"$f":"0.5*(J24+J25)","v":1.2099999999999795},{"$f":"F25-E25","v":2.0000000000010232E-2},{"$f":"IF(B25>0,re(B$10,E25,F25,B$6,B$14,B$13), )","v":0.10278132126023679},null,null,{"$f":"(E24+E25)/2","v":36.329999999999984},{"$f":"(F24+F25)/2","v":36.349999999999994},{"$f":"U24+M25*(B25-B24)*7.48/1440","v":0},0]
[null,4,35.72,35.770000000000003,35.909999999999997,35.960000000000008,null,null,35.920999999999999,0.78999999999999204,null,{"$f":"IF(B26>0,0.5*(B25+B26),0)","v":3.5},{"$f":"IF(B26>0,1440*PI()*P26^2*(E25-E26+F26-F25)/(B26-B25),NA())","v":1.4337123030370298},{"$f":"0.5*(J25+J26)","v":0.90499999999998693},{"$f":"F26-E26","v":5.0000000000011369E-2},{"$f":"IF(B26>0,re(B$10,E26,F26,B$6,B$14,B$13), )","v":0.10278132126023679},null,null,{"$f":"(E25+E26)/2","v":36.024999999999991},36.06,{"$f":"U25+M26*(B26-B25)*7.48/1440","v":7.4473389074423491E-3},{"$f":"IF(P26>0,V25+0.5*(P25+P26)*(L26-L25),0)","v":0.15417198189035519}]
[null,5,35.57,35.630000000000003,35.759999999999991,35.819999999999993,null,null,35.773199999999989,0.63999999999998636,null,4.5,0.47790410101189051,0.7149999999999892,6.0000000000002274E-2,{"$f":"IF(B27>0,re(B$10,E27,F27,B$6,B$14,B$13), )","v":0.10278132126023679},null,null,35.834999999999994,35.89,9.9297852099207804E-3,{"$f":"IF(P27>0,V26+0.5*(P26+P27)*(L27-L26),0)","v":0.25695330315059195}]
[null,6,35.450000000000003,35.53,35.639999999999986,35.72,null,null,35.657599999999988,0.51999999999998181,null,5.5,0.95580820202513928,0.57999999999998408,8.0000000000012506E-2,{"$f":"IF(B28>0,re(B$10,E28,F28,B$6,B$14,B$13), )","v":0.10278132126023679},null,null,35.699999999999989,35.769999999999996,1.48946778148847E-2,0.35973462441082871]
[null,7,35.380000000000003,35.450000000000003,35.569999999999993,35.639999999999986,null,null,35.585399999999993,0.44999999999998863,null,6.5,-0.47790410101324882,0.48499999999998522,6.9999999999993179E-2,{"$f":"IF(B29>0,re(B$10,E29,F29,B$6,B$14,B$13), )","v":0.10278132126023679},null,null,35.60499999999999,35.679999999999993,1.2412231512399213E-2,0.46251594567106546]
[null,8,35.32,35.43,35.509999999999991,35.620000000000005,null,null,35.534199999999991,0.38999999999998636,null,7.5,1.9116164040502786,0.41999999999998749,0.11000000000001364,{"$f":"IF(B30>0,re(B$10,E30,F30,B$6,B$14,B$13), )","v":0.10278132126023679},null,null,35.539999999999992,35.629999999999995,2.2342016722327052E-2,0.56529726693130222]
[null,9,35.31,35.409999999999997,35.5,35.599999999999994,null,null,35.521999999999998,0.37999999999999545,null,8.5,-0.47790410101324882,0.38499999999999091,9.9999999999994316E-2,{"$f":"IF(B31>0,re(B$10,E31,F31,B$6,B$14,B$13), )","v":0.10278132126023679},null,null,35.504999999999995,35.61,1.9859570419841564E-2,0.66807858819153898]
[null,10,35.28,35.409999999999997,35.47,35.599999999999994,null,null,35.498599999999996,0.34999999999999432,null,9.5,1.4337123030370298,0.36499999999999488,0.12999999999999545,{"$f":"IF(B32>0,re(B$10,E32,F32,B$6,B$14,B$13), )","v":0.10278132126023679},null,null,35.484999999999999,35.599999999999994,2.7306909327283913E-2,0.77085990945177574]
[null,11,35.26,35.409999999999997,35.449999999999989,35.599999999999994,null,null,35.48299999999999,0.32999999999998408,null,10.5,0.95580820202513928,0.3399999999999892,0.15000000000000568,{"$f":"IF(B33>0,re(B$10,E33,F33,B$6,B$14,B$13), )","v":0.10278132126023679},null,null,35.459999999999994,35.599999999999994,3.227180193224783E-2,0.8736412307120125]
[null,13,35.25,35.4,35.44,35.590000000000003,null,null,35.472999999999999,0.31999999999999318,null,12,0,0.32499999999998863,0.15000000000000568,{"$f":"IF(B34>0,re(B$10,E34,F34,B$6,B$14,B$13), )","v":0.10278132126023679},null,null,35.444999999999993,35.594999999999999,3.227180193224783E-2,1.0278132126023678]
[null,15,35.24,35.4,35.430000000000007,35.590000000000003,null,null,35.465200000000003,0.31000000000000227,null,14,0.23895205050594526,0.31499999999999773,0.15999999999999659,{"$f":"IF(B35>0,re(B$10,E35,F35,B$6,B$14,B$13), )","v":0.10278132126023679},null,null,35.435000000000002,35.590000000000003,3.4754248234726261E-2,1.2333758551228413]
[null,17,35.229999999999997,35.4,35.419999999999987,35.590000000000003,null,null,35.457399999999993,0.29999999999998295,null,16,0.23895205050662441,0.30499999999999261,0.17000000000001592,{"$f":"IF(B36>0,re(B$10,E36,F36,B$6,B$14,B$13), )","v":0.10278132126023679},null,null,35.424999999999997,35.590000000000003,3.7236694537211748E-2,1.4389384976433148]
[null,19,35.229999999999997,35.4,35.419999999999987,35.590000000000003,null,null,35.457399999999993,0.29999999999998295,null,18,0,0.29999999999998295,0.17000000000001592,{"$f":"IF(B37>0,re(B$10,E37,F37,B$6,B$14,B$13), )","v":0.10278132126023679},null,null,35.419999999999987,35.590000000000003,3.7236694537211748E-2,1.6445011401637883]
[null,21,35.22,35.4,35.409999999999997,35.590000000000003,null,null,35.449599999999997,0.28999999999999204,null,20,0.23895205050594526,0.29499999999998749,0.18000000000000682,{"$f":"IF(B38>0,re(B$10,E38,F38,B$6,B$14,B$13), )","v":0.10278132126023679},null,null,35.414999999999992,35.590000000000003,3.9719140839690179E-2,1.8500637826842619]
[null,31,35.21,35.409999999999997,35.400000000000006,35.599999999999994,null,null,35.444000000000003,0.28000000000000114,null,26,9.5580820202378097E-2,0.28499999999999659,0.19999999999998863,{"$f":"IF(B39>0,re(B$10,E39,F39,B$6,B$14,B$13), )","v":0.10278132126023679},null,null,35.405000000000001,35.594999999999999,4.4684033444647039E-2,2.4667517102456826]
[null,41,35.21,35.409999999999997,35.400000000000006,35.599999999999994,null,null,35.444000000000003,0.28000000000000114,null,36,0,0.28000000000000114,0.19999999999998863,{"$f":"IF(B40>0,re(B$10,E40,F40,B$6,B$14,B$13), )","v":0.10278132126023679},null,null,35.400000000000006,35.599999999999994,4.4684033444647039E-2,3.4945649228480504]
[null,51,35.21,35.479999999999997,35.400000000000006,35.669999999999987,null,null,35.459400000000002,0.28000000000000114,null,46,0.334532870708595,0.28000000000000114,0.26999999999998181,{"$f":"IF(B41>0,re(B$10,E41,F41,B$6,B$14,B$13), )","v":0.10278132126023679},null,null,35.400000000000006,35.634999999999991,6.2061157562010166E-2,4.5223781354504187]
[null,61,35.21,35.42,35.400000000000006,35.610000000000014,null,null,35.446200000000005,0.28000000000000114,null,56,-0.28674246060727016,0.28000000000000114,0.21000000000000796,{"$f":"IF(B42>0,re(B$10,E42,F42,B$6,B$14,B$13), )","v":0.10278132126023679},null,null,35.400000000000006,35.64,4.716647974713252E-2,5.5501913480527865]
[null,71,35.200000000000003,35.42,35.389999999999986,35.610000000000014,null,null,35.438399999999994,0.26999999999998181,null,66,4.7790410101324884E-2,0.27499999999999147,0.22000000000002728,{"$f":"IF(B43>0,re(B$10,E43,F43,B$6,B$14,B$13), )","v":0.10278132126023679},null,null,35.394999999999996,35.610000000000014,4.9648926049618007E-2,6.5780045606551543]
[null,81,35.200000000000003,35.42,35.389999999999986,35.610000000000014,null,null,{"$f":"E44+(1-B$9)*(F44-E44)","v":35.438399999999994},0.26999999999998181,null,76,0,{"$f":"0.5*(J43+J44)","v":0.26999999999998181},{"$f":"F44-E44","v":0.22000000000002728},{"$f":"IF(B44>0,re(B$10,E44,F44,B$6,B$14,B$13), )","v":0.10278132126023679},null,null,35.389999999999986,35.610000000000014,4.9648926049618007E-2,7.6058177732575221]
[null,91,35.200000000000003,35.43,35.389999999999986,35.620000000000005,null,null,35.440599999999989,0.26999999999998181,null,86,4.7790410101189049E-2,0.26999999999998181,0.23000000000001819,{"$f":"IF(B45>0,re(B$10,E45,F45,B$6,B$14,B$13), )","v":0.10278132126023679},null,null,35.389999999999986,35.615000000000009,5.2131372352096438E-2,8.6336309858598899]
[null,121,35.19,35.44,35.379999999999995,35.629999999999995,null,null,{"$f":"E46+(1-B$9)*(F46-E46)","v":35.434999999999995},0.25999999999999091,null,106,3.1860273400792699E-2,{"$f":"0.5*(J45+J46)","v":0.26499999999998636},{"$f":"F46-E46","v":0.25},{"$f":"IF(B46>0,re(B$10,E46,F46,B$6,B$14,B$13), )","v":0.10278132126023679},null,null,35.384999999999991,35.625,5.7096264957053298E-2,10.689257411064625]
[null,151,35.19,35.6,35.379999999999995,35.789999999999992,null,null,{"$f":"E47+(1-B$9)*(F47-E47)","v":35.470199999999991},0.25999999999999091,null,136,0.25488218720656802,{"$f":"0.5*(J46+J47)","v":0.25999999999999091},{"$f":"F47-E47","v":0.40999999999999659},{"$f":"IF(B47>0,re(B$10,E47,F47,B$6,B$14,B$13), )","v":0.10278132126023679},null,null,{"$f":"(E46+E47)/2","v":35.379999999999995},{"$f":"(F46+F47)/2","v":35.709999999999994},{"$f":"U46+M47*(B47-B46)*7.48/1440","v":9.6815405796743484E-2},13.772697048871729]
[null,181,35.19,35.47,35.379999999999995,35.659999999999997,null,null,35.441599999999994,0.25999999999999091,null,166,-0.20709177710533366,0.25999999999999091,0.28000000000000114,{"$f":"IF(B48>0,re(B$10,E48,F48,B$6,B$14,B$13), )","v":0.10278132126023679},null,null,35.379999999999995,35.724999999999994,6.4543603864495647E-2,16.85613668667883]
[null,211,35.18,35.47,35.370000000000005,35.659999999999997,null,null,35.433800000000005,0.25,null,196,1.593013670039635E-2,0.25499999999999545,0.28999999999999204,{"$f":"IF(B49>0,re(B$10,E49,F49,B$6,B$14,B$13), )","v":0.10278132126023679},null,null,35.375,35.659999999999997,6.7026050166974077E-2,19.939576324485934]
[null,241,35.18,35.47,35.370000000000005,35.659999999999997,null,null,35.433800000000005,0.25,null,226,0,0.25,0.28999999999999204,{"$f":"IF(B50>0,re(B$10,E50,F50,B$6,B$14,B$13), )","v":0.10278132126023679},null,null,35.370000000000005,35.659999999999997,6.7026050166974077E-2,23.023015962293037]
[null,271,35.18,35.479999999999997,35.370000000000005,35.669999999999987,null,null,35.436,0.25,null,256,1.593013670039635E-2,0.25,0.29999999999998295,{"$f":"IF(B51>0,re(B$10,E51,F51,B$6,B$14,B$13), )","v":0.10278132126023679},null,null,35.370000000000005,35.664999999999992,6.9508496469452508E-2,26.106455600100141]
[null,301,35.17,35.479999999999997,35.360000000000014,35.669999999999987,null,null,35.428200000000011,0.24000000000000909,null,286,1.593013670039635E-2,0.24500000000000455,0.30999999999997385,{"$f":"IF(B52>0,re(B$10,E52,F52,B$6,B$14,B$13), )","v":0.10278132126023679},null,null,35.365000000000009,35.669999999999987,7.1990942771930938E-2,29.189895237907244]
[null,null,null,null,{"$error":"#N/A"},{"$error":"#N/A"},null,null,{"$error":"#N/A"},{"$error":"#N/A"},null,0,{"$error":"#N/A"},{"$error":"#N/A"},{"$error":"#N/A"},{"$f":"IF(B53>0,re(B$10,E53,F53,B$6,B$14,B$13), )","v":0},null,null,{"$error":"#N/A"},{"$error":"#N/A"},{"$error":"#N/A"},0]
[null,null,null,null,{"$error":"#N/A"},{"$error":"#N/A"},null,null,{"$error":"#N/A"},{"$error":"#N/A"},null,0,{"$error":"#N/A"},{"$error":"#N/A"},{"$error":"#N/A"},{"$f":"IF(B54>0,re(B$10,E54,F54,B$6,B$14,B$13), )","v":0},null,null,{"$error":"#N/A"},{"$error":"#N/A"},{"$error":"#N/A"},0]
[null,null,null,null,{"$error":"#N/A"},{"$error":"#N/A"},null,null,{"$error":"#N/A"},{"$error":"#N/A"},null,0,{"$error":"#N/A"},{"$error":"#N/A"},{"$error":"#N/A"},{"$f":"IF(B55>0,re(B$10,E55,F55,B$6,B$14,B$13), )","v":0},null,null,{"$error":"#N/A"},{"$error":"#N/A"},{"$error":"#N/A"},0]
[null,null,null,null,{"$error":"#N/A"},{"$error":"#N/A"},null,null,{"$error":"#N/A"},{"$f":"E56-E$22-E$7","v":{"$error":"#N/A"}},null,0,{"$error":"#N/A"},{"$error":"#N/A"},{"$error":"#N/A"},{"$f":"IF(B56>0,re(B$10,E56,F56,B$6,B$14,B$13), )","v":0},null,null,{"$error":"#N/A"},{"$error":"#N/A"},{"$error":"#N/A"},0]
[null,null,null,null,{"$error":"#N/A"},{"$error":"#N/A"},null,null,{"$error":"#N/A"},{"$error":"#N/A"},null,0,{"$error":"#N/A"},{"$error":"#N/A"},{"$error":"#N/A"},{"$f":"IF(B57>0,re(B$10,E57,F57,B$6,B$14,B$13), )","v":0},null,null,{"$error":"#N/A"},{"$error":"#N/A"},{"$error":"#N/A"},0]
[null,null,null,null,{"$error":"#N/A"},{"$error":"#N/A"},null,null,{"$error":"#N/A"},{"$error":"#N/A"},null,0,{"$error":"#N/A"},{"$error":"#N/A"},{"$error":"#N/A"},{"$f":"IF(B58>0,re(B$10,E58,F58,B$6,B$14,B$13), )","v":0},null,null,{"$error":"#N/A"},{"$error":"#N/A"},{"$error":"#N/A"},0]
[null,null,null,null,{"$error":"#N/A"},{"$error":"#N/A"},null,null,{"$error":"#N/A"},{"$error":"#N/A"},null,0,{"$error":"#N/A"},{"$error":"#N/A"},{"$error":"#N/A"},{"$f":"IF(B59>0,re(B$10,E59,F59,B$6,B$14,B$13), )","v":0},null,null,{"$error":"#N/A"},{"$error":"#N/A"},{"$error":"#N/A"},0]
[null,null,null,null,{"$error":"#N/A"},{"$error":"#N/A"},null,null,{"$error":"#N/A"},{"$error":"#N/A"},null,0,{"$error":"#N/A"},{"$error":"#N/A"},{"$error":"#N/A"},{"$f":"IF(B60>0,re(B$10,E60,F60,B$6,B$14,B$13), )","v":0},null,null,{"$error":"#N/A"},{"$error":"#N/A"},{"$error":"#N/A"},0]
[null,null,null,null,{"$error":"#N/A"},{"$error":"#N/A"},null,null,{"$error":"#N/A"},{"$error":"#N/A"},null,0,{"$error":"#N/A"},{"$error":"#N/A"},{"$error":"#N/A"},{"$f":"IF(B61>0,re(B$10,E61,F61,B$6,B$14,B$13), )","v":0},null,null,{"$error":"#N/A"},{"$error":"#N/A"},{"$error":"#N/A"},0]
[null,null,null,null,{"$error":"#N/A"},{"$error":"#N/A"},null,null,{"$error":"#N/A"},{"$error":"#N/A"},null,0,{"$error":"#N/A"},{"$error":"#N/A"},{"$error":"#N/A"},{"$f":"IF(B62>0,re(B$10,E62,F62,B$6,B$14,B$13), )","v":0},null,null,{"$error":"#N/A"},{"$error":"#N/A"},{"$error":"#N/A"},0]
[null,null,null,null,{"$error":"#N/A"},{"$error":"#N/A"},null,null,{"$error":"#N/A"},{"$error":"#N/A"},null,0,{"$error":"#N/A"},{"$error":"#N/A"},{"$error":"#N/A"},{"$f":"IF(B63>0,re(B$10,E63,F63,B$6,B$14,B$13), )","v":0},null,null,{"$error":"#N/A"},{"$error":"#N/A"},{"$error":"#N/A"},0]
[null,null,null,null,{"$error":"#N/A"},{"$error":"#N/A"},null,null,{"$error":"#N/A"},{"$error":"#N/A"},null,0,{"$error":"#N/A"},{"$error":"#N/A"},{"$error":"#N/A"},{"$f":"IF(B64>0,re(B$10,E64,F64,B$6,B$14,B$13), )","v":0},null,null,{"$error":"#N/A"},{"$error":"#N/A"},{"$error":"#N/A"},0]
[null,null,null,null,{"$error":"#N/A"},{"$error":"#N/A"},null,null,{"$error":"#N/A"},{"$error":"#N/A"},null,0,{"$error":"#N/A"},{"$error":"#N/A"},{"$error":"#N/A"},{"$f":"IF(B65>0,re(B$10,E65,F65,B$6,B$14,B$13), )","v":0},null,null,{"$error":"#N/A"},{"$error":"#N/A"},{"$error":"#N/A"},0]
[null,null,null,null,{"$error":"#N/A"},{"$error":"#N/A"},null,null,{"$error":"#N/A"},{"$error":"#N/A"},null,0,{"$error":"#N/A"},{"$error":"#N/A"},{"$error":"#N/A"},{"$f":"IF(B66>0,re(B$10,E66,F66,B$6,B$14,B$13), )","v":0},null,null,{"$error":"#N/A"},{"$error":"#N/A"},{"$error":"#N/A"},0]
[null,null,null,null,{"$error":"#N/A"},{"$error":"#N/A"},null,null,{"$error":"#N/A"},{"$error":"#N/A"},null,0,{"$error":"#N/A"},{"$error":"#N/A"},{"$error":"#N/A"},{"$f":"IF(B67>0,re(B$10,E67,F67,B$6,B$14,B$13), )","v":0},null,null,{"$error":"#N/A"},{"$error":"#N/A"},{"$error":"#N/A"},0]
[null,null,null,null,{"$error":"#N/A"},{"$error":"#N/A"},null,null,{"$error":"#N/A"},{"$error":"#N/A"},null,0,{"$error":"#N/A"},{"$error":"#N/A"},{"$error":"#N/A"},{"$f":"IF(B68>0,re(B$10,E68,F68,B$6,B$14,B$13), )","v":0},null,null,{"$error":"#N/A"},{"$error":"#N/A"},{"$error":"#N/A"},0]
[null,null,null,null,{"$error":"#N/A"},{"$error":"#N/A"},null,null,{"$error":"#N/A"},{"$error":"#N/A"},null,0,{"$error":"#N/A"},{"$error":"#N/A"},{"$error":"#N/A"},{"$f":"IF(B69>0,re(B$10,E69,F69,B$6,B$14,B$13), )","v":0},null,null,{"$error":"#N/A"},{"$error":"#N/A"},{"$error":"#N/A"},0]
[null,null,null,null,{"$error":"#N/A"},{"$error":"#N/A"},null,null,{"$error":"#N/A"},{"$error":"#N/A"},null,0,{"$error":"#N/A"},{"$error":"#N/A"},{"$error":"#N/A"},{"$f":"IF(B70>0,re(B$10,E70,F70,B$6,B$14,B$13), )","v":0},null,null,{"$error":"#N/A"},{"$error":"#N/A"},{"$error":"#N/A"},0]
[null,null,null,null,{"$error":"#N/A"},{"$error":"#N/A"},null,null,{"$error":"#N/A"},{"$error":"#N/A"},null,0,{"$error":"#N/A"},{"$error":"#N/A"},{"$error":"#N/A"},{"$f":"IF(B71>0,re(B$10,E71,F71,B$6,B$14,B$13), )","v":0},null,null,{"$error":"#N/A"},{"$error":"#N/A"},{"$error":"#N/A"},0]
[null,null,null,null,{"$error":"#N/A"},{"$error":"#N/A"},null,null,{"$error":"#N/A"},{"$error":"#N/A"},null,0,{"$error":"#N/A"},{"$error":"#N/A"},{"$error":"#N/A"},{"$f":"IF(B72>0,re(B$10,E72,F72,B$6,B$14,B$13), )","v":0},null,null,{"$error":"#N/A"},{"$error":"#N/A"},{"$error":"#N/A"},0]
[null,null,null,null,{"$error":"#N/A"},{"$error":"#N/A"},null,null,{"$error":"#N/A"},{"$error":"#N/A"},null,0,{"$error":"#N/A"},{"$error":"#N/A"},{"$error":"#N/A"},{"$f":"IF(B73>0,re(B$10,E73,F73,B$6,B$14,B$13), )","v":0},null,null,{"$error":"#N/A"},{"$error":"#N/A"},{"$error":"#N/A"},0]
[null,null,null,null,{"$error":"#N/A"},{"$error":"#N/A"},null,null,{"$error":"#N/A"},{"$error":"#N/A"},null,0,{"$error":"#N/A"},{"$error":"#N/A"},{"$error":"#N/A"},{"$f":"IF(B74>0,re(B$10,E74,F74,B$6,B$14,B$13), )","v":0},null,null,{"$error":"#N/A"},{"$error":"#N/A"},{"$error":"#N/A"},0]
[null,null,null,null,{"$error":"#N/A"},{"$error":"#N/A"},null,null,{"$error":"#N/A"},{"$error":"#N/A"},null,0,{"$error":"#N/A"},{"$error":"#N/A"},{"$error":"#N/A"},{"$f":"IF(B75>0,re(B$10,E75,F75,B$6,B$14,B$13), )","v":0},null,null,{"$error":"#N/A"},{"$error":"#N/A"},{"$error":"#N/A"},0]
[null,null,null,null,{"$error":"#N/A"},{"$error":"#N/A"},null,null,{"$error":"#N/A"},{"$error":"#N/A"},null,0,{"$error":"#N/A"},{"$error":"#N/A"},{"$error":"#N/A"},{"$f":"IF(B76>0,re(B$10,E76,F76,B$6,B$14,B$13), )","v":0},null,null,{"$error":"#N/A"},{"$error":"#N/A"},{"$error":"#N/A"},0]
[null,null,null,null,{"$error":"#N/A"},{"$error":"#N/A"},null,null,{"$error":"#N/A"},{"$error":"#N/A"},null,0,{"$error":"#N/A"},{"$error":"#N/A"},{"$error":"#N/A"},{"$f":"IF(B77>0,re(B$10,E77,F77,B$6,B$14,B$13), )","v":0},null,null,{"$error":"#N/A"},{"$error":"#N/A"},{"$error":"#N/A"},0]
[null,null,null,null,{"$error":"#N/A"},{"$error":"#N/A"},null,null,{"$error":"#N/A"},{"$error":"#N/A"},null,0,{"$error":"#N/A"},{"$error":"#N/A"},{"$error":"#N/A"},{"$f":"IF(B78>0,re(B$10,E78,F78,B$6,B$14,B$13), )","v":0},null,null,{"$error":"#N/A"},{"$error":"#N/A"},{"$error":"#N/A"},0]
[null,null,null,null,{"$error":"#N/A"},{"$error":"#N/A"},null,null,{"$error":"#N/A"},{"$error":"#N/A"},null,0,{"$error":"#N/A"},{"$error":"#N/A"},{"$error":"#N/A"},{"$f":"IF(B79>0,re(B$10,E79,F79,B$6,B$14,B$13), )","v":0},null,null,{"$error":"#N/A"},{"$error":"#N/A"},{"$error":"#N/A"},0]
[null,null,null,null,{"$error":"#N/A"},{"$error":"#N/A"},null,null,{"$error":"#N/A"},{"$error":"#N/A"},null,0,{"$error":"#N/A"},{"$error":"#N/A"},{"$error":"#N/A"},{"$f":"IF(B80>0,re(B$10,E80,F80,B$6,B$14,B$13), )","v":0},null,null,{"$error":"#N/A"},{"$error":"#N/A"},{"$error":"#N/A"},0]
[null,null,null,null,{"$error":"#N/A"},{"$error":"#N/A"},null,null,{"$error":"#N/A"},{"$error":"#N/A"},null,0,{"$error":"#N/A"},{"$error":"#N/A"},{"$error":"#N/A"},{"$f":"IF(B81>0,re(B$10,E81,F81,B$6,B$14,B$13), )","v":0},null,null,{"$error":"#N/A"},{"$error":"#N/A"},{"$error":"#N/A"},0]
[null,null,null,null,{"$error":"#N/A"},{"$error":"#N/A"},null,null,{"$error":"#N/A"},{"$error":"#N/A"},null,0,{"$error":"#N/A"},{"$error":"#N/A"},{"$error":"#N/A"},{"$f":"IF(B82>0,re(B$10,E82,F82,B$6,B$14,B$13), )","v":0},null,null,{"$error":"#N/A"},{"$error":"#N/A"},{"$error":"#N/A"},0]
[]
[null,null,null,null,null,null,null,null,null,null,null,null,null,null,null,{"$f":"AVERAGE(P25:P82)","v":4.9618568884252263E-2}]

{"sheet":"Figures","index":2,"n_rows":88,"n_cols":22,"rows_kept":88,"cut":false,"hidden":false,"merged":[]}
[]
[null,null,null,"Figure 1",null,null,null,null,null,null,null,"Figure 2"]
[null,null,null,null,null,null,null,null,null,null,null,null,null,null,null,null,null,null,null,{"$f":"0.8*MIN(Data!B24:B82)","v":0.8},{"$f":"Data!E22","v":35.120000000000005}]
[null,null,null,null,null,null,null,null,null,null,null,null,null,null,null,null,null,null,null,{"$f":"MAX(Data!B24:B82)","v":301},{"$f":"U3","v":35.120000000000005}]
[null,null,null,null,null,null,null,null,null,null,null,null,null,null,null,null,null,null,null,{"$f":"T3","v":0.8},{"$f":"Data!F22","v":36.490000000000009}]
[null,null,null,null,null,null,null,null,null,null,null,null,null,null,null,null,null,null,null,{"$f":"T4","v":301},{"$f":"U5","v":36.490000000000009}]
[]
[null,null,null,null,null,null,null,null,null,null,null,null,null,null,null,null,null,null,null,{"$f":"T4/4","v":75.25},{"$f":"IF(V8<V9,V8,NA())","v":34.120000000000005},{"$f":"IF(Data!B10>Data!E22,Data!B10,Data!E22-1)","v":34.120000000000005}]
[null,null,null,null,null,null,null,null,null,null,null,null,null,null,null,null,null,null,null,{"$f":"T8","v":75.25},{"$f":"IF(V8<V9,V9,NA())","v":37.490000000000009},{"$f":"IF(Data!B11<Data!F22,Data!B11,Data!F22+1)","v":37.490000000000009}]
[]
[]
[]
[]
[]
[]
[]
[]
[]
[]
[]
[null,null,null,"Figure 3",null,null,null,null,null,null,null,"Figure 4"]
[null,"Qn (ft3/d)","sn (ft)",null,null,null,null,null,null,null,null,null,null,null,null,null,null,null,null,"bn","sn"]
[null,0,0,null,null,null,null,null,null,null,null,null,null,null,null,null,null,null,null,0,0]
[null,1,0.38,null,null,null,null,null,null,null,null,null,null,null,null,null,null,null,null,0,0]
[]
[]
[null,"Drawdown Adjust.",null,null,null,null,null,null,null,null,null,null,null,null,null,null,null,null,null,"J-ratio",{"$f":"(U23-U24)/(T23-T24)","v":{"$error":"#DIV/0!"}}]
[null,"Dsn (ft)",0]
[]
[]
[]
[]
[]
[]
[]
[]
[]
[]
[]
[]
[null,null,null,"Figure 5",null,null,null,null,null,null,null,"Figure 6"]
[]
[]
[]
[]
[]
[]
[]
[]
[]
[]
[]
[]
[]
[]
[]
[]
[]
[]
[null,null,null,"Figure 7",null,null,null,null,null,null,null,"Figure 8"]
[]
[]
[]
[]
[]
[]
[]
[]
[]
[]
[]
[]
[]
[]
[]
[]
[]
[]
[null,null,null,"Figure 9",null,null,null,null,null,null,null,"Figure 10"]
[]
[]
[]
[]
[]
[]
[null,null,null,null,null,null,null,null,null,null,null,null,null,null,null,null,null,null,null,"t (min)","sn (ft)"]
[null,null,null,null,null,null,null,null,null,null,null,null,null,null,null,null,null,null,null,12,0.115]
[null,null,null,null,null,null,null,null,null,null,null,null,null,null,null,null,null,null,null,12,0]

{"sheet":"B&R","index":3,"n_rows":64,"n_cols":28,"rows_kept":64,"cut":false,"hidden":false,"merged":[]}
["Generalized Bouwer and Rice (1976)"]
["Well Designation:",null,{"$f":"IF(Data!B1 > 0,Data!B1,\"\")","v":"MW16"}]
["Date:",null,{"$f":"IF(Data!B2 > 0,Data!B2,\"\")","v":"2021-11-09"},null,null,null,null,null,null,null,null,null,null,null,null,null,null,null,null,null,"y = A + B x"]
[null,null,null,null,null,null,null,null,null,null,null,null,null,null,null,null,null,null,null,null,null,null,null,"B&R Type Curve"]
[null,null,null,null,null,null,null,null,null,null,null,null,"Xi","Yi","X2","XY","(y-A-Bx)2","e","count","s/s0","SX",{"$f":"SUM(M6:M64)","v":1968},null,"t (min)","s/s0",null,"Xi","Yi"]
[null,null,null,null,null,null,null,null,null,null,null,null,{"$f":"IF(Data!B24>=D$9,Data!B24-D$9,0)","v":0},{"$f":"IF(S6>0,LN(Data!J24),0)","v":0},{"$f":"M6^2","v":0},{"$f":"M6*N6","v":0},{"$f":"IF(M6>0,(N6-V$11-V$12*M6)^2,0)","v":0},{"$f":"IF(M6>0,(N6-V$11-V$12*M6)/SQRT(V$14),0)","v":0},{"$f":"IF(Data!B24>'B&R'!D$9,1,0)","v":0},{"$f":"IF(S6=0,NA(),EXP(N6)/EXP(V$19))","v":{"$error":"#N/A"}},"SY",{"$f":"SUM(N6:N64)","v":-30.805641190362262},null,0,{"$f":"EXP(-2*E$12*(X6/1440)*(-J$15)/(Data!V$24^2*LN('B&R'!J$12)))","v":{"$error":"#DIV/0!"}},null,{"$f":"IF(S6>0,M6,NA())","v":{"$error":"#N/A"}},{"$f":"IF(T6>0,N6,NA())","v":{"$error":"#N/A"}}]
[null,"Enter early time cut-off for least-squares model fit",null,null,null,null,null,null,null,"Le/re",null,null,{"$f":"IF(Data!B25>=D$9,Data!B25-D$9,0)","v":0},{"$f":"IF(S7>0,LN(Data!J25),0)","v":0},{"$f":"M7^2","v":0},{"$f":"M7*N7","v":0},{"$f":"IF(M7>0,(N7-V$11-V$12*M7)^2,0)","v":0},{"$f":"IF(M7>0,(N7-V$11-V$12*M7)/SQRT(V$14),0)","v":0},{"$f":"IF(Data!B25>'B&R'!D$9,1,0)","v":0},{"$f":"IF(S7=0,NA(),EXP(N7)/EXP(V$19))","v":{"$error":"#N/A"}},"SX2",{"$f":"SUM(O6:O64)","v":355620},null,{"$f":"X6+1.05*(MAX(M$6:M$64)/30)","v":10.430000000000001},{"$f":"EXP(-2*E$12*(X7/1440)*(-J$15)/(Data!V$24^2*LN('B&R'!J$12)))","v":{"$error":"#DIV/0!"}},null,{"$f":"IF(S7>0,M7,NA())","v":{"$error":"#N/A"}},{"$f":"IF(T7>0,N7,NA())","v":{"$error":"#N/A"}}]
[null,null,null,null,null,null,null,null,null,{"$f":"IF(Data!E22<Data!B10,(Data!F22-Data!B10)/Data!B13,(Data!F22-Data!E22)/Data!B13)","v":13.329270174794097},null,null,{"$f":"IF(Data!B26>=D$9,Data!B26-D$9,0)","v":1},{"$f":"IF(S8>0,LN(Data!J26),0)","v":-0.23572233352107994},1,-0.23572233352107994,0.58723011400448277,3.1219406424868374,{"$f":"IF(Data!B26>'B&R'!D$9,1,0)","v":1},2.1476559973887981,"SXY",{"$f":"SUM(P6:P64)","v":-2655.3948112317003},null,{"$f":"X7+1.05*(MAX(M$6:M$64)/30)","v":20.860000000000003},{"$f":"EXP(-2*E$12*(X8/1440)*(-J$15)/(Data!V$24^2*LN('B&R'!J$12)))","v":{"$error":"#DIV/0!"}},null,1,-0.23572233352107994]
[null,null,"Timecut",3,"<-  Enter or change value here",null,null,null,null,"C",null,null,{"$f":"IF(Data!B27>=D$9,Data!B27-D$9,0)","v":2},{"$f":"IF(S9>0,LN(Data!J27),0)","v":-0.44628710262844085},4,-0.89257420525688169,0.31100368101949305,2.271973423351703,{"$f":"IF(Data!B27>'B&R'!D$9,1,0)","v":1},1.7398732130744499,"N",{"$f":"SUM(S6:S64)","v":27},null,31.290000000000006,{"$f":"EXP(-2*E$12*(X9/1440)*(-J$15)/(Data!V$24^2*LN('B&R'!J$12)))","v":{"$error":"#DIV/0!"}},null,2,-0.44628710262844085]
[null,null,null,null,null,null,null,null,null,{"$f":"IF(J8<2000,0.792+0.03993*J8-0.00005743^J8^2+0.00000003858*J8^3-0.000000000009659*J8^4,13.5)","v":1.3243288184901834},null,null,{"$f":"IF(Data!B28>=D$9,Data!B28-D$9,0)","v":3},{"$f":"IF(S10>0,LN(Data!J28),0)","v":-0.65392646740669902},9,-1.9617794022200972,0.12388293233210844,1.4339242865666391,{"$f":"IF(Data!B28>'B&R'!D$9,1,0)","v":1},1.4136469856229712,"D",{"$f":"V9*V7-V5^2","v":5728716},null,41.720000000000006,{"$f":"EXP(-2*E$12*(X10/1440)*(-J$15)/(Data!V$24^2*LN('B&R'!J$12)))","v":{"$error":"#DIV/0!"}},null,3,-0.65392646740669902]
[null,null,null,null,null,null,null,null,null,"R/re",null,null,{"$f":"IF(Data!B29>=D$9,Data!B29-D$9,0)","v":4},{"$f":"IF(S11>0,LN(Data!J29),0)","v":-0.79850769621779683},16,-3.1940307848711873,4.3815382362933267E-2,0.85277367482378441,{"$f":"IF(Data!B29>'B&R'!D$9,1,0)","v":1},1.2233483529429676,"A",{"$f":"(V7*V6-V5*V8)/V10","v":-1.0000993471508521},null,52.150000000000006,{"$f":"EXP(-2*E$12*(X11/1440)*(-J$15)/(Data!V$24^2*LN('B&R'!J$12)))","v":{"$error":"#DIV/0!"}},null,4,-0.79850769621779683]
[null,"Model Results:",null,"Tn (ft2/d) =",{"$f":"1440*V22*(-V12)","v":{"$error":"#DIV/0!"}},"+/-",{"$f":"1440*V22*SQRT(V15)","v":{"$error":"#DIV/0!"}},"ft2/d",null,{"$f":"EXP(((1.1/LN(J8))+J10/J8)^-1)","v":6.7405158957944886},null,null,{"$f":"IF(Data!B30>=D$9,Data!B30-D$9,0)","v":5},{"$f":"IF(S12>0,LN(Data!J30),0)","v":-0.94160853985847992},25,-4.7080426992923998,4.6448036240770742E-3,0.27765414473186789,{"$f":"IF(Data!B30>'B&R'!D$9,1,0)","v":1},1.0602352392172283,"B",{"$f":"(V9*V8-V5*V6)/V10","v":-1.9323977730128304E-3},null,62.580000000000005,{"$f":"EXP(-2*E$12*(X12/1440)*(-J$15)/(Data!V$24^2*LN('B&R'!J$12)))","v":{"$error":"#DIV/0!"}},null,5,-0.94160853985847992]
[null,null,null,null,null,null,null,null,null,null,null,null,{"$f":"IF(Data!B31>=D$9,Data!B31-D$9,0)","v":6},{"$f":"IF(S13>0,LN(Data!J31),0)","v":-0.96758402626171758},{"$f":"M13^2","v":36},{"$f":"M13*N13","v":-5.8055041575703052},{"$f":"IF(M13>0,(N13-V$11-V$12*M13)^2,0)","v":1.9456662981361421E-3},{"$f":"IF(M13>0,(N13-V$11-V$12*M13)/SQRT(V$14),0)","v":0.1797027240019472},{"$f":"IF(Data!B31>'B&R'!D$9,1,0)","v":1},{"$f":"IF(S13=0,NA(),EXP(N13)/EXP(V$19))","v":1.0330497202629643},null,null,null,73.010000000000005,{"$f":"EXP(-2*E$12*(X13/1440)*(-J$15)/(Data!V$24^2*LN('B&R'!J$12)))","v":{"$error":"#DIV/0!"}},null,6,-0.96758402626171758]
[null,null,null,null,null,null,null,null,null,"J-Ratio",null,null,{"$f":"IF(Data!B32>=D$9,Data!B32-D$9,0)","v":7},{"$f":"IF(S14>0,LN(Data!J32),0)","v":-1.0498221244986938},49,-7.3487548714908568,1.3101499046773921E-3,-0.1474622910314442,{"$f":"IF(Data!B32>'B&R'!D$9,1,0)","v":1},0.95149316340009471,"sy2",{"$f":"SUM(Q6:Q64)/(V9-2)","v":6.0250275293113456E-2},null,83.440000000000012,{"$f":"EXP(-2*E$12*(X14/1440)*(-J$15)/(Data!V$24^2*LN('B&R'!J$12)))","v":{"$error":"#DIV/0!"}},null,7,-1.0498221244986938]
[null,null,null,null,null,null,null,null,null,{"$f":"Figures!U27","v":{"$error":"#DIV/0!"}},null,null,{"$f":"IF(Data!B33>=D$9,Data!B33-D$9,0)","v":8},{"$f":"IF(S15>0,LN(Data!J33),0)","v":-1.1086626245216593},{"$f":"M15^2","v":64},{"$f":"M15*N15","v":-8.8693009961732745},{"$f":"IF(M15>0,(N15-V$11-V$12*M15)^2,0)","v":8.6683725405349386E-3},{"$f":"IF(M15>0,(N15-V$11-V$12*M15)/SQRT(V$14),0)","v":-0.37930561000582236},{"$f":"IF(Data!B33>'B&R'!D$9,1,0)","v":1},{"$f":"IF(S15=0,NA(),EXP(N15)/EXP(V$19))","v":0.89712212549148906},"sB2",{"$f":"V9*V14/V10","v":2.8396545280200016E-7},null,93.870000000000019,{"$f":"EXP(-2*E$12*(X15/1440)*(-J$15)/(Data!V$24^2*LN('B&R'!J$12)))","v":{"$error":"#DIV/0!"}},null,8,-1.1086626245216593]
[null,null,null,null,null,null,null,null,null,null,null,null,{"$f":"IF(Data!B34>=D$9,Data!B34-D$9,0)","v":10},{"$f":"IF(S16>0,LN(Data!J34),0)","v":-1.1394342831883861},100,-11.394342831883861,1.4402630113861866E-2,-0.48892403343686969,{"$f":"IF(Data!B34>'B&R'!D$9,1,0)","v":1},0.86993660653722493,null,null,null,104.30000000000003,{"$f":"EXP(-2*E$12*(X16/1440)*(-J$15)/(Data!V$24^2*LN('B&R'!J$12)))","v":{"$error":"#DIV/0!"}},null,10,-1.1394342831883861]
[null,null,null,null,null,null,null,null,null,null,null,null,{"$f":"IF(Data!B35>=D$9,Data!B35-D$9,0)","v":12},{"$f":"IF(S17>0,LN(Data!J35),0)","v":-1.1711829815029378},144,-14.054195778035254,2.1872889932669129E-2,-0.60252291142123071,{"$f":"IF(Data!B35>'B&R'!D$9,1,0)","v":1},0.8427510875829608,null,null,null,114.73000000000003,{"$f":"EXP(-2*E$12*(X17/1440)*(-J$15)/(Data!V$24^2*LN('B&R'!J$12)))","v":{"$error":"#DIV/0!"}},null,12,-1.1711829815029378]
[null,null,null,null,null,null,null,null,null,null,null,null,{"$f":"IF(Data!B36>=D$9,Data!B36-D$9,0)","v":14},{"$f":"IF(S18>0,LN(Data!J36),0)","v":-1.2039728043259927},196,-16.855619260563898,3.1265272917153586E-2,-0.72036332535519687,{"$f":"IF(Data!B36>'B&R'!D$9,1,0)","v":1},0.81556556862861951,"Plot Model Line",null,null,125.16000000000004,{"$f":"EXP(-2*E$12*(X18/1440)*(-J$15)/(Data!V$24^2*LN('B&R'!J$12)))","v":{"$error":"#DIV/0!"}},null,14,-1.2039728043259927]
[null,null,null,null,null,null,null,null,null,null,null,null,{"$f":"IF(Data!B37>=D$9,Data!B37-D$9,0)","v":16},{"$f":"IF(S19>0,LN(Data!J37),0)","v":-1.2039728043259927},256,-19.263564869215884,2.9913464127855612E-2,-0.7046181679677227,{"$f":"IF(Data!B37>'B&R'!D$9,1,0)","v":1},0.81556556862861951,0,{"$f":"V11","v":-1.0000993471508521},null,135.59000000000003,{"$f":"EXP(-2*E$12*(X19/1440)*(-J$15)/(Data!V$24^2*LN('B&R'!J$12)))","v":{"$error":"#DIV/0!"}},null,16,-1.2039728043259927]
[null,null,null,null,null,null,null,null,null,"Coef. Of",null,null,{"$f":"IF(Data!B38>=D$9,Data!B38-D$9,0)","v":18},{"$f":"IF(S20>0,LN(Data!J38),0)","v":-1.2378743560016447},324,-22.281738408029604,4.1205690734683872E-2,-0.82698775958984294,{"$f":"IF(Data!B38>'B&R'!D$9,1,0)","v":1},0.78838004967435527,{"$f":"MAX(M6:M64)","v":298},{"$f":"V11+V12*U20","v":-1.5759538835086757},null,146.02000000000004,{"$f":"EXP(-2*E$12*(X20/1440)*(-J$15)/(Data!V$24^2*LN('B&R'!J$12)))","v":{"$error":"#DIV/0!"}},null,18,-1.2378743560016447]
[null,null,null,null,null,null,null,null,null,"Variation",null,null,{"$f":"IF(Data!B39>=D$9,Data!B39-D$9,0)","v":28},{"$f":"IF(S21>0,LN(Data!J39),0)","v":-1.2729656758128833},784,-35.643038922760731,4.7855583654706282E-2,-0.89122383099199598,{"$f":"IF(Data!B39>'B&R'!D$9,1,0)","v":1},0.76119453072009113,null,null,null,156.45000000000005,{"$f":"EXP(-2*E$12*(X21/1440)*(-J$15)/(Data!V$24^2*LN('B&R'!J$12)))","v":{"$error":"#DIV/0!"}},null,28,-1.2729656758128833]
[null,null,null,null,null,null,null,null,null,{"$f":"G12/E12","v":{"$error":"#DIV/0!"}},null,null,{"$f":"IF(Data!B40>=D$9,Data!B40-D$9,0)","v":38},{"$f":"IF(S22>0,LN(Data!J40),0)","v":-1.2729656758128833},1444,-48.372695680889564,3.9774404299048029E-2,-0.81249804405462467,{"$f":"IF(Data!B40>'B&R'!D$9,1,0)","v":1},0.76119453072009113,"factor",{"$f":"Data!V24^2*LN('B&R'!J12)/(2*(-Figures!U27))","v":{"$error":"#DIV/0!"}},null,166.88000000000005,{"$f":"EXP(-2*E$12*(X22/1440)*(-J$15)/(Data!V$24^2*LN('B&R'!J$12)))","v":{"$error":"#DIV/0!"}},null,38,-1.2729656758128833]
[null,null,null,null,null,null,null,null,null,null,null,null,{"$f":"IF(Data!B41>=D$9,Data!B41-D$9,0)","v":48},{"$f":"IF(S23>0,LN(Data!J41),0)","v":-1.2729656758128833},2304,-61.102352439018404,3.2440057174018759E-2,-0.73377225711725325,{"$f":"IF(Data!B41>'B&R'!D$9,1,0)","v":1},0.76119453072009113,null,null,null,177.31000000000006,{"$f":"EXP(-2*E$12*(X23/1440)*(-J$15)/(Data!V$24^2*LN('B&R'!J$12)))","v":{"$error":"#DIV/0!"}},null,48,-1.2729656758128833]
[null,null,null,null,null,null,null,null,null,null,null,null,{"$f":"IF(Data!B42>=D$9,Data!B42-D$9,0)","v":58},{"$f":"IF(S24>0,LN(Data!J42),0)","v":-1.2729656758128833},3364,-73.832009197147229,2.5852542279618477E-2,-0.65504647017988193,{"$f":"IF(Data!B42>'B&R'!D$9,1,0)","v":1},0.76119453072009113,null,null,null,187.74000000000007,{"$f":"EXP(-2*E$12*(X24/1440)*(-J$15)/(Data!V$24^2*LN('B&R'!J$12)))","v":{"$error":"#DIV/0!"}},null,58,-1.2729656758128833]
[null,null,null,null,null,null,null,null,null,null,null,null,{"$f":"IF(Data!B43>=D$9,Data!B43-D$9,0)","v":68},{"$f":"IF(S25>0,LN(Data!J43),0)","v":-1.3093333199838297},4624,-89.034665758900417,3.1623837626048541E-2,-0.72448228052857055,{"$f":"IF(Data!B43>'B&R'!D$9,1,0)","v":1},0.73400901176574973,"s0 (ft)",{"$f":"EXP(V19)","v":0.36784289521250335},null,198.17000000000007,{"$f":"EXP(-2*E$12*(X25/1440)*(-J$15)/(Data!V$24^2*LN('B&R'!J$12)))","v":{"$error":"#DIV/0!"}},null,68,-1.3093333199838297]
[null,null,null,null,null,null,null,null,null,null,null,null,{"$f":"IF(Data!B44>=D$9,Data!B44-D$9,0)","v":78},{"$f":"IF(S26>0,LN(Data!J44),0)","v":-1.3093333199838297},6084,-102.12799895873871,2.5124452100793049E-2,-0.64575649359119924,{"$f":"IF(Data!B44>'B&R'!D$9,1,0)","v":1},0.73400901176574973,null," ",null,208.60000000000008,{"$f":"EXP(-2*E$12*(X26/1440)*(-J$15)/(Data!V$24^2*LN('B&R'!J$12)))","v":{"$error":"#DIV/0!"}},null,78,-1.3093333199838297]
[null,null,null,null,null,null,null,null,null,null,null,null,{"$f":"IF(Data!B45>=D$9,Data!B45-D$9,0)","v":88},{"$f":"IF(S27>0,LN(Data!J45),0)","v":-1.3093333199838297},7744,-115.22133215857701,1.9371898806166535E-2,-0.56703070665382793,{"$f":"IF(Data!B45>'B&R'!D$9,1,0)","v":1},0.73400901176574973,null,null,null,219.03000000000009,{"$f":"EXP(-2*E$12*(X27/1440)*(-J$15)/(Data!V$24^2*LN('B&R'!J$12)))","v":{"$error":"#DIV/0!"}},null,88,-1.3093333199838297]
[null,null,null,null,null,null,null,null,null,null,null,null,{"$f":"IF(Data!B46>=D$9,Data!B46-D$9,0)","v":118},{"$f":"IF(S28>0,LN(Data!J46),0)","v":-1.3470736479666443},13924,-158.95469046006403,1.4149426902365588E-2,-0.48460724999206017,{"$f":"IF(Data!B46>'B&R'!D$9,1,0)","v":1},0.7068234928114856,null,null,null,229.46000000000009,{"$f":"EXP(-2*E$12*(X28/1440)*(-J$15)/(Data!V$24^2*LN('B&R'!J$12)))","v":{"$error":"#DIV/0!"}},null,118,-1.3470736479666443]
[null,null,null,null,null,null,null,null,null,null,null,null,{"$f":"IF(Data!B47>=D$9,Data!B47-D$9,0)","v":148},{"$f":"IF(S29>0,LN(Data!J47),0)","v":-1.3470736479666443},21904,-199.36689989906336,3.7184909331150181E-3,-0.24842988917994616,{"$f":"IF(Data!B47>'B&R'!D$9,1,0)","v":1},0.7068234928114856,null,null,null,239.8900000000001,{"$f":"EXP(-2*E$12*(X29/1440)*(-J$15)/(Data!V$24^2*LN('B&R'!J$12)))","v":{"$error":"#DIV/0!"}},null,148,-1.3470736479666443]
[null,null,null,null,null,null,null,null,null,null,null,null,{"$f":"IF(Data!B48>=D$9,Data!B48-D$9,0)","v":178},{"$f":"IF(S30>0,LN(Data!J48),0)","v":-1.3470736479666443},31684,-239.77910933806268,9.0450395253506461E-6,-1.225252836783214E-2,{"$f":"IF(Data!B48>'B&R'!D$9,1,0)","v":1},0.7068234928114856,null,null,null,250.32000000000011,{"$f":"EXP(-2*E$12*(X30/1440)*(-J$15)/(Data!V$24^2*LN('B&R'!J$12)))","v":{"$error":"#DIV/0!"}},null,178,-1.3470736479666443]
[null,null,null,null,null,null,null,null,null,null,null,null,{"$f":"IF(Data!B49>=D$9,Data!B49-D$9,0)","v":208},{"$f":"IF(S31>0,LN(Data!J49),0)","v":-1.3862943611198906},43264,-288.34922711293723,2.4786480815837159E-4,6.4139846642928308E-2,{"$f":"IF(Data!B49>'B&R'!D$9,1,0)","v":1},0.67963797385722147,null,null,null,260.75000000000011,{"$f":"EXP(-2*E$12*(X31/1440)*(-J$15)/(Data!V$24^2*LN('B&R'!J$12)))","v":{"$error":"#DIV/0!"}},null,208,-1.3862943611198906]
[null,null,null,null,null,null,null,null,null,null,null,null,{"$f":"IF(Data!B50>=D$9,Data!B50-D$9,0)","v":238},{"$f":"IF(S32>0,LN(Data!J50),0)","v":-1.3862943611198906},56644,-329.93805794653395,5.4339979406920298E-3,0.30031720745504253,{"$f":"IF(Data!B50>'B&R'!D$9,1,0)","v":1},0.67963797385722147,null,null,null,271.18000000000012,{"$f":"EXP(-2*E$12*(X32/1440)*(-J$15)/(Data!V$24^2*LN('B&R'!J$12)))","v":{"$error":"#DIV/0!"}},null,238,-1.3862943611198906]
[null,null,null,null,null,null,null,null,null,null,null,null,{"$f":"IF(Data!B51>=D$9,Data!B51-D$9,0)","v":268},{"$f":"IF(S33>0,LN(Data!J51),0)","v":-1.3862943611198906},71824,-371.52688878013066,1.7341621148886575E-2,0.53649456826715636,{"$f":"IF(Data!B51>'B&R'!D$9,1,0)","v":1},0.67963797385722147,null,null,null,281.61000000000013,{"$f":"EXP(-2*E$12*(X33/1440)*(-J$15)/(Data!V$24^2*LN('B&R'!J$12)))","v":{"$error":"#DIV/0!"}},null,268,-1.3862943611198906]
[null,null,null,null,null,null,null,null,null,null,null,null,{"$f":"IF(Data!B52>=D$9,Data!B52-D$9,0)","v":298},{"$f":"IF(S34>0,LN(Data!J52),0)","v":-1.4271163556401079},88804,-425.28067398075217,2.215260970202668E-2,0.6063633311374208,{"$f":"IF(Data!B52>'B&R'!D$9,1,0)","v":1},0.65245245490295734,null,null,null,292.04000000000013,{"$f":"EXP(-2*E$12*(X34/1440)*(-J$15)/(Data!V$24^2*LN('B&R'!J$12)))","v":{"$error":"#DIV/0!"}},null,298,-1.4271163556401079]
[null,"C coefficient calculated from Eq. 6.5(c) of Butler, The Design, Performance, and",null,null,null,null,null,null,null,null,null,null,{"$f":"IF(Data!B53>=D$9,Data!B53-D$9,0)","v":0},{"$f":"IF(S35>0,LN(Data!J53),0)","v":0},0,0,0,0,{"$f":"IF(Data!B53>'B&R'!D$9,1,0)","v":0},{"$error":"#N/A"},null,null,null,302.47000000000014,{"$f":"EXP(-2*E$12*(X35/1440)*(-J$15)/(Data!V$24^2*LN('B&R'!J$12)))","v":{"$error":"#DIV/0!"}},null,{"$error":"#N/A"},{"$error":"#N/A"}]
[null,"Analysis of Slug Tests, CRC Press, 2000.",null,null,null,null,null,null,null,null,null,null,{"$f":"IF(Data!B54>=D$9,Data!B54-D$9,0)","v":0},{"$f":"IF(S36>0,LN(Data!J54),0)","v":0},0,0,0,0,{"$f":"IF(Data!B54>'B&R'!D$9,1,0)","v":0},{"$error":"#N/A"},null,null,null,312.90000000000015,{"$f":"EXP(-2*E$12*(X36/1440)*(-J$15)/(Data!V$24^2*LN('B&R'!J$12)))","v":{"$error":"#DIV/0!"}},null,{"$error":"#N/A"},{"$error":"#N/A"}]
[null,null,null,null,null,null,null,null,null,null,null,null,{"$f":"IF(Data!B55>=D$9,Data!B55-D$9,0)","v":0},{"$f":"IF(S37>0,LN(Data!J55),0)","v":0},0,0,0,0,{"$f":"IF(Data!B55>'B&R'!D$9,1,0)","v":0},{"$error":"#N/A"},null,null,null,null,null,null,{"$error":"#N/A"},{"$error":"#N/A"}]
[null,null,null,null,null,null,null,null,null,null,null,null,{"$f":"IF(Data!B56>=D$9,Data!B56-D$9,0)","v":0},{"$f":"IF(S38>0,LN(Data!J56),0)","v":0},0,0,0,0,{"$f":"IF(Data!B56>'B&R'!D$9,1,0)","v":0},{"$error":"#N/A"},null,null,null,null,null,null,{"$error":"#N/A"},{"$error":"#N/A"}]
[null,null,null,null,null,null,null,null,null,null,null,null,{"$f":"IF(Data!B57>=D$9,Data!B57-D$9,0)","v":0},{"$f":"IF(S39>0,LN(Data!J57),0)","v":0},0,0,0,0,{"$f":"IF(Data!B57>'B&R'!D$9,1,0)","v":0},{"$error":"#N/A"},null,null,null,{"$f":"TRUNC(100*E12)/100","v":{"$error":"#DIV/0!"}},null,null,{"$error":"#N/A"},{"$error":"#N/A"}]
[null,null,null,null,null,null,null,null,null,null,null,null,{"$f":"IF(Data!B58>=D$9,Data!B58-D$9,0)","v":0},{"$f":"IF(S40>0,LN(Data!J58),0)","v":0},0,0,0,0,{"$f":"IF(Data!B58>'B&R'!D$9,1,0)","v":0},{"$error":"#N/A"},null,null,null,{"$f":"X39","v":{"$error":"#DIV/0!"}},null,null,{"$error":"#N/A"},{"$error":"#N/A"}]
[null,null,null,null,null,null,null,null,null,null,null,null,{"$f":"IF(Data!B59>=D$9,Data!B59-D$9,0)","v":0},{"$f":"IF(S41>0,LN(Data!J59),0)","v":0},0,0,0,0,{"$f":"IF(Data!B59>'B&R'!D$9,1,0)","v":0},{"$error":"#N/A"},null,null,null,{"$f":"CONCATENATE(\" T = \",X40,\" ft2/d\")","v":{"$error":"#DIV/0!"}},null,null,{"$error":"#N/A"},{"$error":"#N/A"}]
[null,null,null,null,null,null,null,null,null,null,null,null,{"$f":"IF(Data!B60>=D$9,Data!B60-D$9,0)","v":0},{"$f":"IF(S42>0,LN(Data!J60),0)","v":0},0,0,0,0,{"$f":"IF(Data!B60>'B&R'!D$9,1,0)","v":0},{"$error":"#N/A"},null,null,null,null,null,null,{"$error":"#N/A"},{"$error":"#N/A"}]
[null,null,null,null,null,null,null,null,null,null,null,null,{"$f":"IF(Data!B61>=D$9,Data!B61-D$9,0)","v":0},{"$f":"IF(S43>0,LN(Data!J61),0)","v":0},0,0,0,0,{"$f":"IF(Data!B61>'B&R'!D$9,1,0)","v":0},{"$error":"#N/A"},null,null,null,null,null,null,{"$error":"#N/A"},{"$error":"#N/A"}]
[null,null,null,null,null,null,null,null,null,null,null,null,{"$f":"IF(Data!B62>=D$9,Data!B62-D$9,0)","v":0},{"$f":"IF(S44>0,LN(Data!J62),0)","v":0},0,0,0,0,{"$f":"IF(Data!B62>'B&R'!D$9,1,0)","v":0},{"$error":"#N/A"},null,null,null,null,null,null,{"$error":"#N/A"},{"$error":"#N/A"}]
[null,null,null,null,null,null,null,null,null,null,null,null,{"$f":"IF(Data!B63>=D$9,Data!B63-D$9,0)","v":0},{"$f":"IF(S45>0,LN(Data!J63),0)","v":0},0,0,0,0,{"$f":"IF(Data!B63>'B&R'!D$9,1,0)","v":0},{"$error":"#N/A"},null,null,null,null,null,null,{"$error":"#N/A"},{"$error":"#N/A"}]
[null,null,null,null,null,null,null,null,null,null,null,null,{"$f":"IF(Data!B64>=D$9,Data!B64-D$9,0)","v":0},{"$f":"IF(S46>0,LN(Data!J64),0)","v":0},0,0,0,0,{"$f":"IF(Data!B64>'B&R'!D$9,1,0)","v":0},{"$error":"#N/A"},null,null,null,null,null,null,{"$error":"#N/A"},{"$error":"#N/A"}]
[null,null,null,null,null,null,null,null,null,null,null,null,{"$f":"IF(Data!B65>=D$9,Data!B65-D$9,0)","v":0},{"$f":"IF(S47>0,LN(Data!J65),0)","v":0},0,0,0,0,{"$f":"IF(Data!B65>'B&R'!D$9,1,0)","v":0},{"$error":"#N/A"},null,null,null,null,null,null,{"$error":"#N/A"},{"$error":"#N/A"}]
[null,null,null,null,null,null,null,null,null,null,null,null,{"$f":"IF(Data!B66>=D$9,Data!B66-D$9,0)","v":0},{"$f":"IF(S48>0,LN(Data!J66),0)","v":0},{"$f":"M48^2","v":0},{"$f":"M48*N48","v":0},0,{"$f":"IF(M48>0,(N48-V$11-V$12*M48)/SQRT(V$14),0)","v":0},{"$f":"IF(Data!B66>'B&R'!D$9,1,0)","v":0},{"$f":"IF(S48=0,NA(),EXP(N48)/EXP(V$19))","v":{"$error":"#N/A"}},null,null,null,null,null,null,{"$error":"#N/A"},{"$error":"#N/A"}]
[null,null,null,null,null,null,null,null,null,null,null,null,{"$f":"IF(Data!B67>=D$9,Data!B67-D$9,0)","v":0},{"$f":"IF(S49>0,LN(Data!J67),0)","v":0},0,0,0,0,{"$f":"IF(Data!B67>'B&R'!D$9,1,0)","v":0},{"$error":"#N/A"},null,null,null,null,null,null,{"$error":"#N/A"},{"$error":"#N/A"}]
[null,null,null,null,null,null,null,null,null,null,null,null,{"$f":"IF(Data!B68>=D$9,Data!B68-D$9,0)","v":0},{"$f":"IF(S50>0,LN(Data!J68),0)","v":0},0,0,0,0,{"$f":"IF(Data!B68>'B&R'!D$9,1,0)","v":0},{"$error":"#N/A"},null,null,null,null,null,null,{"$error":"#N/A"},{"$error":"#N/A"}]
[null,null,null,null,null,null,null,null,null,null,null,null,{"$f":"IF(Data!B69>=D$9,Data!B69-D$9,0)","v":0},{"$f":"IF(S51>0,LN(Data!J69),0)","v":0},0,0,0,0,{"$f":"IF(Data!B69>'B&R'!D$9,1,0)","v":0},{"$error":"#N/A"},null,null,null,null,null,null,{"$error":"#N/A"},{"$error":"#N/A"}]
[null,null,null,null,null,null,null,null,null,null,null,null,{"$f":"IF(Data!B70>=D$9,Data!B70-D$9,0)","v":0},{"$f":"IF(S52>0,LN(Data!J70),0)","v":0},0,0,0,0,{"$f":"IF(Data!B70>'B&R'!D$9,1,0)","v":0},{"$error":"#N/A"},null,null,null,null,null,null,{"$error":"#N/A"},{"$error":"#N/A"}]
[null,null,null,null,null,null,null,null,null,null,null,null,{"$f":"IF(Data!B71>=D$9,Data!B71-D$9,0)","v":0},{"$f":"IF(S53>0,LN(Data!J71),0)","v":0},0,0,0,0,{"$f":"IF(Data!B71>'B&R'!D$9,1,0)","v":0},{"$error":"#N/A"},null,null,null,null,null,null,{"$error":"#N/A"},{"$error":"#N/A"}]
[null,null,null,null,null,null,null,null,null,null,null,null,{"$f":"IF(Data!B72>=D$9,Data!B72-D$9,0)","v":0},{"$f":"IF(S54>0,LN(Data!J72),0)","v":0},0,0,0,0,{"$f":"IF(Data!B72>'B&R'!D$9,1,0)","v":0},{"$error":"#N/A"},null,null,null,null,null,null,{"$error":"#N/A"},{"$error":"#N/A"}]
[null,null,null,null,null,null,null,null,null,null,null,null,{"$f":"IF(Data!B73>=D$9,Data!B73-D$9,0)","v":0},{"$f":"IF(S55>0,LN(Data!J73),0)","v":0},0,0,0,0,{"$f":"IF(Data!B73>'B&R'!D$9,1,0)","v":0},{"$error":"#N/A"},null,null,null,null,null,null,{"$error":"#N/A"},{"$error":"#N/A"}]
[null,null,null,null,null,null,null,null,null,null,null,null,{"$f":"IF(Data!B74>=D$9,Data!B74-D$9,0)","v":0},{"$f":"IF(S56>0,LN(Data!J74),0)","v":0},0,0,0,0,{"$f":"IF(Data!B74>'B&R'!D$9,1,0)","v":0},{"$error":"#N/A"},null,null,null,null,null,null,{"$error":"#N/A"},{"$error":"#N/A"}]
[null,null,null,null,null,null,null,null,null,null,null,null,{"$f":"IF(Data!B75>=D$9,Data!B75-D$9,0)","v":0},{"$f":"IF(S57>0,LN(Data!J75),0)","v":0},0,0,0,0,{"$f":"IF(Data!B75>'B&R'!D$9,1,0)","v":0},{"$error":"#N/A"},null,null,null,null,null,null,{"$error":"#N/A"},{"$error":"#N/A"}]
[null,null,null,null,null,null,null,null,null,null,null,null,{"$f":"IF(Data!B76>=D$9,Data!B76-D$9,0)","v":0},{"$f":"IF(S58>0,LN(Data!J76),0)","v":0},0,0,0,0,{"$f":"IF(Data!B76>'B&R'!D$9,1,0)","v":0},{"$error":"#N/A"},null,null,null,null,null,null,{"$error":"#N/A"},{"$error":"#N/A"}]
[null,null,null,null,null,null,null,null,null,null,null,null,{"$f":"IF(Data!B77>=D$9,Data!B77-D$9,0)","v":0},{"$f":"IF(S59>0,LN(Data!J77),0)","v":0},0,0,0,0,{"$f":"IF(Data!B77>'B&R'!D$9,1,0)","v":0},{"$error":"#N/A"},null,null,null,null,null,null,{"$error":"#N/A"},{"$error":"#N/A"}]
[null,null,null,null,null,null,null,null,null,null,null,null,{"$f":"IF(Data!B78>=D$9,Data!B78-D$9,0)","v":0},{"$f":"IF(S60>0,LN(Data!J78),0)","v":0},0,0,0,0,{"$f":"IF(Data!B78>'B&R'!D$9,1,0)","v":0},{"$error":"#N/A"},null,null,null,null,null,null,{"$error":"#N/A"},{"$error":"#N/A"}]
[null,null,null,null,null,null,null,null,null,null,null,null,{"$f":"IF(Data!B79>=D$9,Data!B79-D$9,0)","v":0},{"$f":"IF(S61>0,LN(Data!J79),0)","v":0},{"$f":"M61^2","v":0},{"$f":"M61*N61","v":0},0,{"$f":"IF(M61>0,(N61-V$11-V$12*M61)/SQRT(V$14),0)","v":0},{"$f":"IF(Data!B79>'B&R'!D$9,1,0)","v":0},{"$f":"IF(S61=0,NA(),EXP(N61)/EXP(V$19))","v":{"$error":"#N/A"}},null,null,null,null,null,null,{"$error":"#N/A"},{"$error":"#N/A"}]
[null,null,null,null,null,null,null,null,null,null,null,null,{"$f":"IF(Data!B80>=D$9,Data!B80-D$9,0)","v":0},{"$f":"IF(S62>0,LN(Data!J80),0)","v":0},0,0,0,0,{"$f":"IF(Data!B80>'B&R'!D$9,1,0)","v":0},{"$error":"#N/A"},null,null,null,null,null,null,{"$error":"#N/A"},{"$error":"#N/A"}]
[null,null,null,null,null,null,null,null,null,null,null,null,{"$f":"IF(Data!B81>=D$9,Data!B81-D$9,0)","v":0},{"$f":"IF(S63>0,LN(Data!J81),0)","v":0},0,0,0,0,{"$f":"IF(Data!B81>'B&R'!D$9,1,0)","v":0},{"$error":"#N/A"},null,null,null,null,null,null,{"$error":"#N/A"},{"$error":"#N/A"}]
[null,null,null,null,null,null,null,null,null,null,null,null,{"$f":"IF(Data!B82>=D$9,Data!B82-D$9,0)","v":0},{"$f":"IF(S64>0,LN(Data!J82),0)","v":0},0,0,0,0,{"$f":"IF(Data!B82>'B&R'!D$9,1,0)","v":0},{"$error":"#N/A"},null,null,null,null,null,null,{"$error":"#N/A"},{"$error":"#N/A"}]

{"sheet":"C&J","index":4,"n_rows":66,"n_cols":26,"rows_kept":66,"cut":false,"hidden":false,"merged":[]}
["Cooper and Jacob (1946)"]
["Well Designation:",null,{"$f":"IF(Data!B1 > 0,Data!B1,\"\")","v":"MW16"},null,null,null,null,null,null,null,null,null,null,null,null,null,null,null,null,null,null,null,{"$f":"E10","v":13},{"$f":"E9","v":26},0]
["Date:",null,{"$f":"IF(Data!B2 > 0,Data!B2,\"\")","v":"2021-11-09"},null,null,null,null,null,null,null,null,null,null,null,null,0,{"$f":"MAX(P9:Q58)","v":1.7346803257238388},null,null,null,null,null,{"$f":"W2","v":13},{"$f":"X2","v":26},{"$f":"J50","v":70}]
[null,null,null,null,null,null,null,null,null,null,null,null,null,null,null,0,{"$f":"Q3","v":1.7346803257238388}]
[null,null,null,null,null,null,null,null,null,null,null,null,null,null,null,null,null,null,null,null,null,null,null,{"$f":"MAX(T9:T66)+10","v":296}]
[]
[null,null,null,null,null,null,null,null,null,null,null,null,null,"Index","ti","Vi (meas)","Vi (calc)","SE",null,"Time","Qn/sn",null,"Index","Time","Qn/sn","A-Time"]
[null,"Enter early time cut-off for least-squares model fit"]
[null,null,"    Timecut (min):",null,26,"<-  Enter or change values here",null,null,null,null,null,null,null,1,{"$f":"IF(Data!L25>=E$9,Data!L25-E$10,0)","v":0},{"$f":"IF(O9>0,7.48*Data!M25*(Data!B25-Data!B24)/1440,0)","v":0},{"$f":"IF(O9>0,7.48*(4*PI()*(E$16/1440)*Data!N25)*(Data!B25-Data!B24)/LN(0.56146/((Data!P25^2*'C&J'!E$15)/(4*('C&J'!E$16/1440)*O9))),0)","v":0},{"$f":"(P9-Q9)^2","v":0},null,{"$f":"Data!L25","v":2},{"$f":"Data!M25/Data!N25","v":0},null,0,{"$f":"2+(X$5-2)*W9/50","v":2},{"$f":"4*PI()*E$18/LN(0.56146/(Data!V$24^2*'C&J'!E$15/(4*'C&J'!E$18*'C&J'!X9/1440)))","v":10.732574921594068},{"$f":"X9+E$10","v":15}]
[null,"  Time Adjustment (min):",null,null,13,null,null,null,null,null,null,null,null,2,{"$f":"IF(Data!L26>=E$9,Data!L26-E$10,0)","v":0},{"$f":"IF(O10>0,P9+7.48*Data!M26*(Data!B26-Data!B25)/1440,0)","v":0},{"$f":"IF(O10>0,Q9+7.48*(4*PI()*(E$16/1440)*Data!N26)*(Data!B26-Data!B25)/LN(0.56146/((Data!P26^2*'C&J'!E$15)/(4*('C&J'!E$16/1440)*O10))),0)","v":0},{"$f":"(P10-Q10)^2","v":0},null,{"$f":"Data!L26","v":3.5},{"$f":"Data!M26/Data!N26","v":1.5842124895437022},null,1,{"$f":"2+(X$5-2)*W10/50","v":7.88},{"$f":"4*PI()*E$18/LN(0.56146/(Data!V$24^2*'C&J'!E$15/(4*'C&J'!E$18*'C&J'!X10/1440)))","v":7.308855690194342},{"$f":"X10+E$10","v":20.88}]
[null,null,null,null,null,null,null,null,null,null,null,null,null,3,{"$f":"IF(Data!L27>=E$9,Data!L27-E$10,0)","v":0},{"$f":"IF(O11>0,P10+7.48*Data!M27*(Data!B27-Data!B26)/1440,0)","v":0},{"$f":"IF(O11>0,Q10+7.48*(4*PI()*(E$16/1440)*Data!N27)*(Data!B27-Data!B26)/LN(0.56146/((Data!P27^2*'C&J'!E$15)/(4*('C&J'!E$16/1440)*O11))),0)","v":0},0,null,{"$f":"Data!L27","v":4.5},{"$f":"Data!M27/Data!N27","v":0.66839734407258422},null,2,13.76,{"$f":"4*PI()*E$18/LN(0.56146/(Data!V$24^2*'C&J'!E$15/(4*'C&J'!E$18*'C&J'!X11/1440)))","v":6.4698066729061434},26.759999999999998]
[null,"Trial Sn:",null,null,"d","<-- Enter d for default or enter Sn value",null,null,null,null,null,null,null,4,{"$f":"IF(Data!L28>=E$9,Data!L28-E$10,0)","v":0},{"$f":"IF(O12>0,P11+7.48*Data!M28*(Data!B28-Data!B27)/1440,0)","v":0},{"$f":"IF(O12>0,Q11+7.48*(4*PI()*(E$16/1440)*Data!N28)*(Data!B28-Data!B27)/LN(0.56146/((Data!P28^2*'C&J'!E$15)/(4*('C&J'!E$16/1440)*O12))),0)","v":0},0,null,{"$f":"Data!L28","v":5.5},{"$f":"Data!M28/Data!N28","v":1.6479451759054577},null,3,19.64,{"$f":"4*PI()*E$18/LN(0.56146/(Data!V$24^2*'C&J'!E$15/(4*'C&J'!E$18*'C&J'!X12/1440)))","v":6.0281029585290788},32.64]
[null,null,null,null,null,null,null,null,null,null,null,null,null,5,{"$f":"IF(Data!L29>=E$9,Data!L29-E$10,0)","v":0},{"$f":"IF(O13>0,P12+7.48*Data!M29*(Data!B29-Data!B28)/1440,0)","v":0},{"$f":"IF(O13>0,Q12+7.48*(4*PI()*(E$16/1440)*Data!N29)*(Data!B29-Data!B28)/LN(0.56146/((Data!P29^2*'C&J'!E$15)/(4*('C&J'!E$16/1440)*O13))),0)","v":0},0,null,{"$f":"Data!L29","v":6.5},{"$f":"Data!M29/Data!N29","v":-0.98536928043971828},null,4,25.52,{"$f":"4*PI()*E$18/LN(0.56146/(Data!V$24^2*'C&J'!E$15/(4*'C&J'!E$18*'C&J'!X13/1440)))","v":5.7396708636053511},38.519999999999996]
[null,"Root-Mean-Square Error:",null,null,{"$f":"SQRT(SUM(R9:R58))","v":3.4729492622950957},"<-- Minimize this using \"Solver\"",null,null,null,null,null,null,null,6,{"$f":"IF(Data!L30>=E$9,Data!L30-E$10,0)","v":0},{"$f":"IF(O14>0,P13+7.48*Data!M30*(Data!B30-Data!B29)/1440,0)","v":0},{"$f":"IF(O14>0,Q13+7.48*(4*PI()*(E$16/1440)*Data!N30)*(Data!B30-Data!B29)/LN(0.56146/((Data!P30^2*'C&J'!E$15)/(4*('C&J'!E$16/1440)*O14))),0)","v":0},0,null,{"$f":"Data!L30","v":7.5},{"$f":"Data!M30/Data!N30","v":4.5514676286912747},null,5,31.4,{"$f":"4*PI()*E$18/LN(0.56146/(Data!V$24^2*'C&J'!E$15/(4*'C&J'!E$18*'C&J'!X14/1440)))","v":5.530177316734818},44.4]
[null,null,null,null,{"$f":"IF(E12=\"d\",0.025*SQRT(E16),E12)","v":3.952847075210475E-2},"<-- Working Sn",null,null,null,null,null,null,null,7,{"$f":"IF(Data!L31>=E$9,Data!L31-E$10,0)","v":0},{"$f":"IF(O15>0,P14+7.48*Data!M31*(Data!B31-Data!B30)/1440,0)","v":0},{"$f":"IF(O15>0,Q14+7.48*(4*PI()*(E$16/1440)*Data!N31)*(Data!B31-Data!B30)/LN(0.56146/((Data!P31^2*'C&J'!E$15)/(4*('C&J'!E$16/1440)*O15))),0)","v":0},0,null,{"$f":"Data!L31","v":8.5},{"$f":"Data!M31/Data!N31","v":-1.2413093532811952},null,6,37.28,{"$f":"4*PI()*E$18/LN(0.56146/(Data!V$24^2*'C&J'!E$15/(4*'C&J'!E$18*'C&J'!X15/1440)))","v":5.3679807502661108},50.28]
[null,"Trial Tn (ft2/d):",null,null,2.5,"<-- By changing Tn through \"Solver\"",null,null,null,null,null,null,null,8,{"$f":"IF(Data!L32>=E$9,Data!L32-E$10,0)","v":0},{"$f":"IF(O16>0,P15+7.48*Data!M32*(Data!B32-Data!B31)/1440,0)","v":0},{"$f":"IF(O16>0,Q15+7.48*(4*PI()*(E$16/1440)*Data!N32)*(Data!B32-Data!B31)/LN(0.56146/((Data!P32^2*'C&J'!E$15)/(4*('C&J'!E$16/1440)*O16))),0)","v":0},0,null,{"$f":"Data!L32","v":9.5},{"$f":"Data!M32/Data!N32","v":3.9279789124302735},null,7,43.16,{"$f":"4*PI()*E$18/LN(0.56146/(Data!V$24^2*'C&J'!E$15/(4*'C&J'!E$18*'C&J'!X16/1440)))","v":5.2369273755817742},56.16]
[null,null,null,null,null,null,"Add constraint Tn > 0.00001",null,null,null,null,null,null,9,{"$f":"IF(Data!L33>=E$9,Data!L33-E$10,0)","v":0},{"$f":"IF(O17>0,P16+7.48*Data!M33*(Data!B33-Data!B32)/1440,0)","v":0},{"$f":"IF(O17>0,Q16+7.48*(4*PI()*(E$16/1440)*Data!N33)*(Data!B33-Data!B32)/LN(0.56146/((Data!P33^2*'C&J'!E$15)/(4*('C&J'!E$16/1440)*O17))),0)","v":0},0,null,{"$f":"Data!L33","v":10.5},{"$f":"Data!M33/Data!N33","v":2.8112005941916753},null,8,49.04,{"$f":"4*PI()*E$18/LN(0.56146/(Data!V$24^2*'C&J'!E$15/(4*'C&J'!E$18*'C&J'!X17/1440)))","v":5.1277531762224768},62.04]
[null,"Model Result:",null,"Tn (ft2/d) =",{"$f":"E16","v":2.5},null,null,null,null,null,null,null,null,10,{"$f":"IF(Data!L34>=E$9,Data!L34-E$10,0)","v":0},{"$f":"IF(O18>0,P17+7.48*Data!M34*(Data!B34-Data!B33)/1440,0)","v":0},{"$f":"IF(O18>0,Q17+7.48*(4*PI()*(E$16/1440)*Data!N34)*(Data!B34-Data!B33)/LN(0.56146/((Data!P34^2*'C&J'!E$15)/(4*('C&J'!E$16/1440)*O18))),0)","v":0},0,null,{"$f":"Data!L34","v":12},{"$f":"Data!M34/Data!N34","v":0},null,9,54.92,{"$f":"4*PI()*E$18/LN(0.56146/(Data!V$24^2*'C&J'!E$15/(4*'C&J'!E$18*'C&J'!X18/1440)))","v":5.034694858144606},67.92]
[null,null,null,null,null,null,null,null,null,null,null,null,null,11,{"$f":"IF(Data!L35>=E$9,Data!L35-E$10,0)","v":0},{"$f":"IF(O19>0,P18+7.48*Data!M35*(Data!B35-Data!B34)/1440,0)","v":0},{"$f":"IF(O19>0,Q18+7.48*(4*PI()*(E$16/1440)*Data!N35)*(Data!B35-Data!B34)/LN(0.56146/((Data!P35^2*'C&J'!E$15)/(4*('C&J'!E$16/1440)*O19))),0)","v":0},0,null,{"$f":"Data!L35","v":14},{"$f":"Data!M35/Data!N35","v":0.75857793811411744},null,10,60.8,{"$f":"4*PI()*E$18/LN(0.56146/(Data!V$24^2*'C&J'!E$15/(4*'C&J'!E$18*'C&J'!X19/1440)))","v":4.9539439431872463},73.8]
[null,null,null,null,null,null,null,null,null,null,null,null,null,12,{"$f":"IF(Data!L36>=E$9,Data!L36-E$10,0)","v":0},{"$f":"IF(O20>0,P19+7.48*Data!M36*(Data!B36-Data!B35)/1440,0)","v":0},{"$f":"IF(O20>0,Q19+7.48*(4*PI()*(E$16/1440)*Data!N36)*(Data!B36-Data!B35)/LN(0.56146/((Data!P36^2*'C&J'!E$15)/(4*('C&J'!E$16/1440)*O20))),0)","v":0},0,null,{"$f":"Data!L36","v":16},{"$f":"Data!M36/Data!N36","v":0.78344934592337767},null,11,66.680000000000007,{"$f":"4*PI()*E$18/LN(0.56146/(Data!V$24^2*'C&J'!E$15/(4*'C&J'!E$18*'C&J'!X20/1440)))","v":4.8828636272472972},79.680000000000007]
[null,null,null,null,null,null,null,null,null,null,null,null,null,13,{"$f":"IF(Data!L37>=E$9,Data!L37-E$10,0)","v":0},{"$f":"IF(O21>0,P20+7.48*Data!M37*(Data!B37-Data!B36)/1440,0)","v":0},{"$f":"IF(O21>0,Q20+7.48*(4*PI()*(E$16/1440)*Data!N37)*(Data!B37-Data!B36)/LN(0.56146/((Data!P37^2*'C&J'!E$15)/(4*('C&J'!E$16/1440)*O21))),0)","v":0},0,null,{"$f":"Data!L37","v":18},{"$f":"Data!M37/Data!N37","v":0},null,12,72.56,{"$f":"4*PI()*E$18/LN(0.56146/(Data!V$24^2*'C&J'!E$15/(4*'C&J'!E$18*'C&J'!X21/1440)))","v":4.8195592539425993},85.56]
[null,null,null,null,null,null,null,null,null,null,null,null,null,14,{"$f":"IF(Data!L38>=E$9,Data!L38-E$10,0)","v":0},{"$f":"IF(O22>0,P21+7.48*Data!M38*(Data!B38-Data!B37)/1440,0)","v":0},{"$f":"IF(O22>0,Q21+7.48*(4*PI()*(E$16/1440)*Data!N38)*(Data!B38-Data!B37)/LN(0.56146/((Data!P38^2*'C&J'!E$15)/(4*('C&J'!E$16/1440)*O22))),0)","v":0},0,null,{"$f":"Data!L38","v":20},{"$f":"Data!M38/Data!N38","v":0.8100069508676454},null,13,78.44,{"$f":"4*PI()*E$18/LN(0.56146/(Data!V$24^2*'C&J'!E$15/(4*'C&J'!E$18*'C&J'!X22/1440)))","v":4.7626275600265284},91.44]
[null,null,null,null,null,null,null,null,null,null,null,null,null,15,{"$f":"IF(Data!L39>=E$9,Data!L39-E$10,0)","v":13},{"$f":"IF(O23>0,P22+7.48*Data!M39*(Data!B39-Data!B38)/1440,0)","v":4.9648926049568618E-3},{"$f":"IF(O23>0,Q22+7.48*(4*PI()*(E$16/1440)*Data!N39)*(Data!B39-Data!B38)/LN(0.56146/((Data!P39^2*'C&J'!E$15)/(4*('C&J'!E$16/1440)*O23))),0)","v":9.6914068843565848E-2},8.4546510109587761E-3,null,{"$f":"Data!L39","v":26},{"$f":"Data!M39/Data!N39","v":0.33537129895571666},null,14,84.32,{"$f":"4*PI()*E$18/LN(0.56146/(Data!V$24^2*'C&J'!E$15/(4*'C&J'!E$18*'C&J'!X23/1440)))","v":4.7110027116505542},97.32]
[null,null,null,null,null,null,null,null,null,null,null,null,null,16,{"$f":"IF(Data!L40>=E$9,Data!L40-E$10,0)","v":23},{"$f":"IF(O24>0,P23+7.48*Data!M40*(Data!B40-Data!B39)/1440,0)","v":4.9648926049568618E-3},{"$f":"IF(O24>0,Q23+7.48*(4*PI()*(E$16/1440)*Data!N40)*(Data!B40-Data!B39)/LN(0.56146/((Data!P40^2*'C&J'!E$15)/(4*('C&J'!E$16/1440)*O24))),0)","v":0.18201079974793277},3.134525323607925E-2,null,{"$f":"Data!L40","v":36},{"$f":"Data!M40/Data!N40","v":0},null,15,90.2,{"$f":"4*PI()*E$18/LN(0.56146/(Data!V$24^2*'C&J'!E$15/(4*'C&J'!E$18*'C&J'!X24/1440)))","v":4.6638577475554568},103.2]
[null,null,null,null,null,null,null,null,null,null,null,null,null,17,{"$f":"IF(Data!L41>=E$9,Data!L41-E$10,0)","v":33},{"$f":"IF(O25>0,P24+7.48*Data!M41*(Data!B41-Data!B40)/1440,0)","v":2.2342016722319991E-2},{"$f":"IF(O25>0,Q24+7.48*(4*PI()*(E$16/1440)*Data!N41)*(Data!B41-Data!B40)/LN(0.56146/((Data!P41^2*'C&J'!E$15)/(4*('C&J'!E$16/1440)*O25))),0)","v":0.26174657349775887},5.7314541804844334E-2,null,{"$f":"Data!L41","v":46},{"$f":"Data!M41/Data!N41","v":1.1947602525306915},null,16,96.08,{"$f":"4*PI()*E$18/LN(0.56146/(Data!V$24^2*'C&J'!E$15/(4*'C&J'!E$18*'C&J'!X25/1440)))","v":4.6205392405160746},109.08]
[null,null,null,null,null,null,null,null,null,null,null,null,null,18,{"$f":"IF(Data!L42>=E$9,Data!L42-E$10,0)","v":43},{"$f":"IF(O26>0,P25+7.48*Data!M42*(Data!B42-Data!B41)/1440,0)","v":7.4473389074423465E-3},{"$f":"IF(O26>0,Q25+7.48*(4*PI()*(E$16/1440)*Data!N42)*(Data!B42-Data!B41)/LN(0.56146/((Data!P42^2*'C&J'!E$15)/(4*('C&J'!E$16/1440)*O26))),0)","v":0.33796195887497588},0.1092399140122831,null,{"$f":"Data!L42","v":56},{"$f":"Data!M42/Data!N42","v":-1.0240802164545322},null,17,101.96,{"$f":"4*PI()*E$18/LN(0.56146/(Data!V$24^2*'C&J'!E$15/(4*'C&J'!E$18*'C&J'!X26/1440)))","v":4.5805226670972807},114.96]
[null,null,null,null,null,null,null,null,null,null,null,null,null,19,{"$f":"IF(Data!L43>=E$9,Data!L43-E$10,0)","v":53},{"$f":"IF(O27>0,P26+7.48*Data!M43*(Data!B43-Data!B42)/1440,0)","v":9.9297852099278338E-3},{"$f":"IF(O27>0,Q26+7.48*(4*PI()*(E$16/1440)*Data!N43)*(Data!B43-Data!B42)/LN(0.56146/((Data!P43^2*'C&J'!E$15)/(4*('C&J'!E$16/1440)*O27))),0)","v":0.41029367947387391},0.16029124783019219,null,{"$f":"Data!L43","v":66},{"$f":"Data!M43/Data!N43","v":0.1737833094593686},null,18,107.84,{"$f":"4*PI()*E$18/LN(0.56146/(Data!V$24^2*'C&J'!E$15/(4*'C&J'!E$18*'C&J'!X27/1440)))","v":4.5433811257918997},120.84]
[null,null,null,null,null,null,null,null,null,null,null,null,null,20,{"$f":"IF(Data!L44>=E$9,Data!L44-E$10,0)","v":63},{"$f":"IF(O28>0,P27+7.48*Data!M44*(Data!B44-Data!B43)/1440,0)","v":9.9297852099278338E-3},{"$f":"IF(O28>0,Q27+7.48*(4*PI()*(E$16/1440)*Data!N44)*(Data!B44-Data!B43)/LN(0.56146/((Data!P44^2*'C&J'!E$15)/(4*('C&J'!E$16/1440)*O28))),0)","v":0.47938548074171594},0.22038865006723496,null,{"$f":"Data!L44","v":76},{"$f":"Data!M44/Data!N44","v":0},null,19,113.72,{"$f":"4*PI()*E$18/LN(0.56146/(Data!V$24^2*'C&J'!E$15/(4*'C&J'!E$18*'C&J'!X28/1440)))","v":4.5087629121716821},126.72]
[null,null,null,null,null,null,null,null,null,null,null,null,null,21,{"$f":"IF(Data!L45>=E$9,Data!L45-E$10,0)","v":73},{"$f":"IF(O29>0,P28+7.48*Data!M45*(Data!B45-Data!B44)/1440,0)","v":1.2412231512406264E-2},{"$f":"IF(O29>0,Q28+7.48*(4*PI()*(E$16/1440)*Data!N45)*(Data!B45-Data!B44)/LN(0.56146/((Data!P45^2*'C&J'!E$15)/(4*('C&J'!E$16/1440)*O29))),0)","v":0.546917165734364},0.28569552470761939,null,{"$f":"Data!L45","v":86},{"$f":"Data!M45/Data!N45","v":0.1770015188933047},null,20,119.6,{"$f":"4*PI()*E$18/LN(0.56146/(Data!V$24^2*'C&J'!E$15/(4*'C&J'!E$18*'C&J'!X29/1440)))","v":4.4763751216985819},132.6]
[null,null,null,null,null,null,null,null,null,null,null,null,null,22,{"$f":"IF(Data!L46>=E$9,Data!L46-E$10,0)","v":93},{"$f":"IF(O30>0,P29+7.48*Data!M46*(Data!B46-Data!B45)/1440,0)","v":1.7377124117363127E-2},{"$f":"IF(O30>0,Q29+7.48*(4*PI()*(E$16/1440)*Data!N46)*(Data!B46-Data!B45)/LN(0.56146/((Data!P46^2*'C&J'!E$15)/(4*('C&J'!E$16/1440)*O30))),0)","v":0.73864494260439484},0.52022726598504165,null,{"$f":"Data!L46","v":106},{"$f":"Data!M46/Data!N46","v":0.12022744679545033},null,21,125.48,{"$f":"4*PI()*E$18/LN(0.56146/(Data!V$24^2*'C&J'!E$15/(4*'C&J'!E$18*'C&J'!X30/1440)))","v":4.4459714474352845},138.48000000000002]
[null,null,null,null,null,null,null,null,null,null,null,null,null,23,{"$f":"IF(Data!L47>=E$9,Data!L47-E$10,0)","v":123},{"$f":"IF(O31>0,P30+7.48*Data!M47*(Data!B47-Data!B46)/1440,0)","v":5.7096264957053312E-2},{"$f":"IF(O31>0,Q30+7.48*(4*PI()*(E$16/1440)*Data!N47)*(Data!B47-Data!B46)/LN(0.56146/((Data!P47^2*'C&J'!E$15)/(4*('C&J'!E$16/1440)*O31))),0)","v":0.9192912149987984},0.7433801318774873,null,{"$f":"Data!L47","v":136},{"$f":"Data!M47/Data!N47","v":0.98031610464068053},null,22,131.36000000000001,{"$f":"4*PI()*E$18/LN(0.56146/(Data!V$24^2*'C&J'!E$15/(4*'C&J'!E$18*'C&J'!X31/1440)))","v":4.4173429557980484},144.36000000000001]
[null,null,null,null,null,null,null,null,null,null,null,null,null,24,{"$f":"IF(Data!L48>=E$9,Data!L48-E$10,0)","v":153},{"$f":"IF(O32>0,P31+7.48*Data!M48*(Data!B48-Data!B47)/1440,0)","v":2.4824463024805475E-2},{"$f":"IF(O32>0,Q31+7.48*(4*PI()*(E$16/1440)*Data!N48)*(Data!B48-Data!B47)/LN(0.56146/((Data!P48^2*'C&J'!E$15)/(4*('C&J'!E$16/1440)*O32))),0)","v":1.0945101380320619},1.1442274433157296,null,{"$f":"Data!L48","v":166},{"$f":"Data!M48/Data!N48","v":-0.79650683502054198},null,23,137.24,{"$f":"4*PI()*E$18/LN(0.56146/(Data!V$24^2*'C&J'!E$15/(4*'C&J'!E$18*'C&J'!X32/1440)))","v":4.3903110144593471},150.24]
[null,null,null,null,null,null,null,null,null,null,null,null,null,25,{"$f":"IF(Data!L49>=E$9,Data!L49-E$10,0)","v":183},{"$f":"IF(O33>0,P32+7.48*Data!M49*(Data!B49-Data!B48)/1440,0)","v":2.7306909327283906E-2},{"$f":"IF(O33>0,Q32+7.48*(4*PI()*(E$16/1440)*Data!N49)*(Data!B49-Data!B48)/LN(0.56146/((Data!P49^2*'C&J'!E$15)/(4*('C&J'!E$16/1440)*O33))),0)","v":1.2622257474423011},1.525024536731344,null,{"$f":"Data!L49","v":196},{"$f":"Data!M49/Data!N49","v":6.2471124315280915E-2},null,24,143.12,{"$f":"4*PI()*E$18/LN(0.56146/(Data!V$24^2*'C&J'!E$15/(4*'C&J'!E$18*'C&J'!X33/1440)))","v":4.3647218006909778},156.12]
[null,null,null,null,null,null,null,null,null,null,null,null,null,26,{"$f":"IF(Data!L50>=E$9,Data!L50-E$10,0)","v":213},{"$f":"IF(O34>0,P33+7.48*Data!M50*(Data!B50-Data!B49)/1440,0)","v":2.7306909327283906E-2},{"$f":"IF(O34>0,Q33+7.48*(4*PI()*(E$16/1440)*Data!N50)*(Data!B50-Data!B49)/LN(0.56146/((Data!P50^2*'C&J'!E$15)/(4*('C&J'!E$16/1440)*O34))),0)","v":1.423366439351172},1.9489822113705191,null,{"$f":"Data!L50","v":226},{"$f":"Data!M50/Data!N50","v":0},null,25,149,{"$f":"4*PI()*E$18/LN(0.56146/(Data!V$24^2*'C&J'!E$15/(4*'C&J'!E$18*'C&J'!X34/1440)))","v":4.3404419872841684},162]
[null,null,null,null,null,null,null,null,null,null,null,null,null,27,{"$f":"IF(Data!L51>=E$9,Data!L51-E$10,0)","v":243},{"$f":"IF(O35>0,P34+7.48*Data!M51*(Data!B51-Data!B50)/1440,0)","v":2.9789355629762336E-2},{"$f":"IF(O35>0,Q34+7.48*(4*PI()*(E$16/1440)*Data!N51)*(Data!B51-Data!B50)/LN(0.56146/((Data!P51^2*'C&J'!E$15)/(4*('C&J'!E$16/1440)*O35))),0)","v":1.5817592086386498},2.4086104246484279,null,{"$f":"Data!L51","v":256},{"$f":"Data!M51/Data!N51","v":6.3720546801585398E-2},null,26,154.88,{"$f":"4*PI()*E$18/LN(0.56146/(Data!V$24^2*'C&J'!E$15/(4*'C&J'!E$18*'C&J'!X35/1440)))","v":4.3173553175423534},167.88]
[null,null,null,null,null,null,null,null,null,null,null,null,null,28,{"$f":"IF(Data!L52>=E$9,Data!L52-E$10,0)","v":273},{"$f":"IF(O36>0,P35+7.48*Data!M52*(Data!B52-Data!B51)/1440,0)","v":3.2271801932240766E-2},{"$f":"IF(O36>0,Q35+7.48*(4*PI()*(E$16/1440)*Data!N52)*(Data!B52-Data!B51)/LN(0.56146/((Data!P52^2*'C&J'!E$15)/(4*('C&J'!E$16/1440)*O36))),0)","v":1.7346803257238388},2.8981947818782881,null,{"$f":"Data!L52","v":286},{"$f":"Data!M52/Data!N52","v":6.5020966124065521E-2},null,27,160.76,{"$f":"4*PI()*E$18/LN(0.56146/(Data!V$24^2*'C&J'!E$15/(4*'C&J'!E$18*'C&J'!X36/1440)))","v":4.2953598596766041},173.76]
[null,null,null,null,null,null,null,null,null,null,null,null,null,29,{"$f":"IF(Data!L53>=E$9,Data!L53-E$10,0)","v":0},{"$f":"IF(O37>0,P36+7.48*Data!M53*(Data!B53-Data!B52)/1440,0)","v":0},{"$f":"IF(O37>0,Q36+7.48*(4*PI()*(E$16/1440)*Data!N53)*(Data!B53-Data!B52)/LN(0.56146/((Data!P53^2*'C&J'!E$15)/(4*('C&J'!E$16/1440)*O37))),0)","v":0},0,null,{"$f":"Data!L53","v":0},{"$f":"Data!M53/Data!N53","v":{"$error":"#N/A"}},null,28,166.64,{"$f":"4*PI()*E$18/LN(0.56146/(Data!V$24^2*'C&J'!E$15/(4*'C&J'!E$18*'C&J'!X37/1440)))","v":4.2743657861610167},179.64]
[null,null,null,null,null,null,null,null,null,null,null,null,null,30,{"$f":"IF(Data!L54>=E$9,Data!L54-E$10,0)","v":0},{"$f":"IF(O38>0,P37+7.48*Data!M54*(Data!B54-Data!B53)/1440,0)","v":0},{"$f":"IF(O38>0,Q37+7.48*(4*PI()*(E$16/1440)*Data!N54)*(Data!B54-Data!B53)/LN(0.56146/((Data!P54^2*'C&J'!E$15)/(4*('C&J'!E$16/1440)*O38))),0)","v":0},0,null,{"$f":"Data!L54","v":0},{"$f":"Data!M54/Data!N54","v":{"$error":"#N/A"}},null,29,172.52,{"$f":"4*PI()*E$18/LN(0.56146/(Data!V$24^2*'C&J'!E$15/(4*'C&J'!E$18*'C&J'!X38/1440)))","v":4.2542935628700063},185.52]
[null,null,null,null,null,null,null,null,null,null,null,null,null,31,{"$f":"IF(Data!L55>=E$9,Data!L55-E$10,0)","v":0},{"$f":"IF(O39>0,P38+7.48*Data!M55*(Data!B55-Data!B54)/1440,0)","v":0},{"$f":"IF(O39>0,Q38+7.48*(4*PI()*(E$16/1440)*Data!N55)*(Data!B55-Data!B54)/LN(0.56146/((Data!P55^2*'C&J'!E$15)/(4*('C&J'!E$16/1440)*O39))),0)","v":0},0,null,{"$f":"Data!L55","v":0},{"$f":"Data!M55/Data!N55","v":{"$error":"#N/A"}},null,30,178.4,{"$f":"4*PI()*E$18/LN(0.56146/(Data!V$24^2*'C&J'!E$15/(4*'C&J'!E$18*'C&J'!X39/1440)))","v":4.2350724611166806},191.4]
[null,null,null,null,null,null,null,null,null,null,null,null,null,32,{"$f":"IF(Data!L56>=E$9,Data!L56-E$10,0)","v":0},{"$f":"IF(O40>0,P39+7.48*Data!M56*(Data!B56-Data!B55)/1440,0)","v":0},{"$f":"IF(O40>0,Q39+7.48*(4*PI()*(E$16/1440)*Data!N56)*(Data!B56-Data!B55)/LN(0.56146/((Data!P56^2*'C&J'!E$15)/(4*('C&J'!E$16/1440)*O40))),0)","v":0},0,null,{"$f":"Data!L56","v":0},{"$f":"Data!M56/Data!N56","v":{"$error":"#N/A"}},null,31,184.28,{"$f":"4*PI()*E$18/LN(0.56146/(Data!V$24^2*'C&J'!E$15/(4*'C&J'!E$18*'C&J'!X40/1440)))","v":4.2166393263618547},197.28]
[null,null,null,null,null,null,null,null,null,null,null,null,null,33,{"$f":"IF(Data!L57>=E$9,Data!L57-E$10,0)","v":0},{"$f":"IF(O41>0,P40+7.48*Data!M57*(Data!B57-Data!B56)/1440,0)","v":0},{"$f":"IF(O41>0,Q40+7.48*(4*PI()*(E$16/1440)*Data!N57)*(Data!B57-Data!B56)/LN(0.56146/((Data!P57^2*'C&J'!E$15)/(4*('C&J'!E$16/1440)*O41))),0)","v":0},0,null,{"$f":"Data!L57","v":0},{"$f":"Data!M57/Data!N57","v":{"$error":"#N/A"}},null,32,190.16,{"$f":"4*PI()*E$18/LN(0.56146/(Data!V$24^2*'C&J'!E$15/(4*'C&J'!E$18*'C&J'!X41/1440)))","v":4.1989375526089949},203.16]
[null,null,null,null,null,null,null,null,null,null,null,null,null,34,{"$f":"IF(Data!L58>=E$9,Data!L58-E$10,0)","v":0},{"$f":"IF(O42>0,P41+7.48*Data!M58*(Data!B58-Data!B57)/1440,0)","v":0},{"$f":"IF(O42>0,Q41+7.48*(4*PI()*(E$16/1440)*Data!N58)*(Data!B58-Data!B57)/LN(0.56146/((Data!P58^2*'C&J'!E$15)/(4*('C&J'!E$16/1440)*O42))),0)","v":0},0,null,{"$f":"Data!L58","v":0},{"$f":"Data!M58/Data!N58","v":{"$error":"#N/A"}},null,33,196.04,{"$f":"4*PI()*E$18/LN(0.56146/(Data!V$24^2*'C&J'!E$15/(4*'C&J'!E$18*'C&J'!X42/1440)))","v":4.1819162228779225},209.04]
[null,null,null,null,null,null,null,null,null,null,null,null,null,35,{"$f":"IF(Data!L59>=E$9,Data!L59-E$10,0)","v":0},{"$f":"IF(O43>0,P42+7.48*Data!M59*(Data!B59-Data!B58)/1440,0)","v":0},{"$f":"IF(O43>0,Q42+7.48*(4*PI()*(E$16/1440)*Data!N59)*(Data!B59-Data!B58)/LN(0.56146/((Data!P59^2*'C&J'!E$15)/(4*('C&J'!E$16/1440)*O43))),0)","v":0},0,null,{"$f":"Data!L59","v":0},{"$f":"Data!M59/Data!N59","v":{"$error":"#N/A"}},null,34,201.92,{"$f":"4*PI()*E$18/LN(0.56146/(Data!V$24^2*'C&J'!E$15/(4*'C&J'!E$18*'C&J'!X43/1440)))","v":4.1655293847264643},214.92]
[null,null,null,null,null,null,null,null,null,null,null,null,null,36,{"$f":"IF(Data!L60>=E$9,Data!L60-E$10,0)","v":0},{"$f":"IF(O44>0,P43+7.48*Data!M60*(Data!B60-Data!B59)/1440,0)","v":0},{"$f":"IF(O44>0,Q43+7.48*(4*PI()*(E$16/1440)*Data!N60)*(Data!B60-Data!B59)/LN(0.56146/((Data!P60^2*'C&J'!E$15)/(4*('C&J'!E$16/1440)*O44))),0)","v":0},0,null,{"$f":"Data!L60","v":0},{"$f":"Data!M60/Data!N60","v":{"$error":"#N/A"}},null,35,207.8,{"$f":"4*PI()*E$18/LN(0.56146/(Data!V$24^2*'C&J'!E$15/(4*'C&J'!E$18*'C&J'!X44/1440)))","v":4.1497354363148817},220.8]
[null,null,null,null,null,null,null,null,null,null,null,null,null,37,{"$f":"IF(Data!L61>=E$9,Data!L61-E$10,0)","v":0},{"$f":"IF(O45>0,P44+7.48*Data!M61*(Data!B61-Data!B60)/1440,0)","v":0},{"$f":"IF(O45>0,Q44+7.48*(4*PI()*(E$16/1440)*Data!N61)*(Data!B61-Data!B60)/LN(0.56146/((Data!P61^2*'C&J'!E$15)/(4*('C&J'!E$16/1440)*O45))),0)","v":0},0,null,{"$f":"Data!L61","v":0},{"$f":"Data!M61/Data!N61","v":{"$error":"#N/A"}},null,36,213.68,{"$f":"4*PI()*E$18/LN(0.56146/(Data!V$24^2*'C&J'!E$15/(4*'C&J'!E$18*'C&J'!X45/1440)))","v":4.1344966035168778},226.68]
[null,null,null,null,null,null,null,null,null,null,null,null,null,38,{"$f":"IF(Data!L62>=E$9,Data!L62-E$10,0)","v":0},{"$f":"IF(O46>0,P45+7.48*Data!M62*(Data!B62-Data!B61)/1440,0)","v":0},{"$f":"IF(O46>0,Q45+7.48*(4*PI()*(E$16/1440)*Data!N62)*(Data!B62-Data!B61)/LN(0.56146/((Data!P62^2*'C&J'!E$15)/(4*('C&J'!E$16/1440)*O46))),0)","v":0},0,null,{"$f":"Data!L62","v":0},{"$f":"Data!M62/Data!N62","v":{"$error":"#N/A"}},null,37,219.56,{"$f":"4*PI()*E$18/LN(0.56146/(Data!V$24^2*'C&J'!E$15/(4*'C&J'!E$18*'C&J'!X46/1440)))","v":4.1197784924574981},232.56]
[null,null,null,null,null,null,null,null,null,null,null,null,null,39,{"$f":"IF(Data!L63>=E$9,Data!L63-E$10,0)","v":0},{"$f":"IF(O47>0,P46+7.48*Data!M63*(Data!B63-Data!B62)/1440,0)","v":0},{"$f":"IF(O47>0,Q46+7.48*(4*PI()*(E$16/1440)*Data!N63)*(Data!B63-Data!B62)/LN(0.56146/((Data!P63^2*'C&J'!E$15)/(4*('C&J'!E$16/1440)*O47))),0)","v":0},0,null,{"$f":"Data!L63","v":0},{"$f":"Data!M63/Data!N63","v":{"$error":"#N/A"}},null,38,225.44,{"$f":"4*PI()*E$18/LN(0.56146/(Data!V$24^2*'C&J'!E$15/(4*'C&J'!E$18*'C&J'!X47/1440)))","v":4.1055497048815193},238.44]
[null,null,null,null,null,null,null,null,null,null,null,null,null,40,{"$f":"IF(Data!L64>=E$9,Data!L64-E$10,0)","v":0},{"$f":"IF(O48>0,P47+7.48*Data!M64*(Data!B64-Data!B63)/1440,0)","v":0},{"$f":"IF(O48>0,Q47+7.48*(4*PI()*(E$16/1440)*Data!N64)*(Data!B64-Data!B63)/LN(0.56146/((Data!P64^2*'C&J'!E$15)/(4*('C&J'!E$16/1440)*O48))),0)","v":0},0,null,{"$f":"Data!L64","v":0},{"$f":"Data!M64/Data!N64","v":{"$error":"#N/A"}},null,39,231.32,{"$f":"4*PI()*E$18/LN(0.56146/(Data!V$24^2*'C&J'!E$15/(4*'C&J'!E$18*'C&J'!X48/1440)))","v":4.0917815061310741},244.32]
[null,null,null,null,null,null,null,null,null,"Height",null,null,null,41,{"$f":"IF(Data!L65>=E$9,Data!L65-E$10,0)","v":0},{"$f":"IF(O49>0,P48+7.48*Data!M65*(Data!B65-Data!B64)/1440,0)","v":0},{"$f":"IF(O49>0,Q48+7.48*(4*PI()*(E$16/1440)*Data!N65)*(Data!B65-Data!B64)/LN(0.56146/((Data!P65^2*'C&J'!E$15)/(4*('C&J'!E$16/1440)*O49))),0)","v":0},0,null,{"$f":"Data!L65","v":0},{"$f":"Data!M65/Data!N65","v":{"$error":"#N/A"}},null,40,237.2,{"$f":"4*PI()*E$18/LN(0.56146/(Data!V$24^2*'C&J'!E$15/(4*'C&J'!E$18*'C&J'!X49/1440)))","v":4.0784475373898781},250.2]
[null,null,null,null,null,null,null,null,null,70,null,null,null,42,{"$f":"IF(Data!L66>=E$9,Data!L66-E$10,0)","v":0},{"$f":"IF(O50>0,P49+7.48*Data!M66*(Data!B66-Data!B65)/1440,0)","v":0},{"$f":"IF(O50>0,Q49+7.48*(4*PI()*(E$16/1440)*Data!N66)*(Data!B66-Data!B65)/LN(0.56146/((Data!P66^2*'C&J'!E$15)/(4*('C&J'!E$16/1440)*O50))),0)","v":0},0,null,{"$f":"Data!L66","v":0},{"$f":"Data!M66/Data!N66","v":{"$error":"#N/A"}},null,41,243.08,{"$f":"4*PI()*E$18/LN(0.56146/(Data!V$24^2*'C&J'!E$15/(4*'C&J'!E$18*'C&J'!X50/1440)))","v":4.0655235653471777},256.08000000000004]
[null,null,null,null,null,null,null,null,null,null,null,null,null,43,{"$f":"IF(Data!L67>=E$9,Data!L67-E$10,0)","v":0},{"$f":"IF(O51>0,P50+7.48*Data!M67*(Data!B67-Data!B66)/1440,0)","v":0},{"$f":"IF(O51>0,Q50+7.48*(4*PI()*(E$16/1440)*Data!N67)*(Data!B67-Data!B66)/LN(0.56146/((Data!P67^2*'C&J'!E$15)/(4*('C&J'!E$16/1440)*O51))),0)","v":0},0,null,{"$f":"Data!L67","v":0},{"$f":"Data!M67/Data!N67","v":{"$error":"#N/A"}},null,42,248.96,{"$f":"4*PI()*E$18/LN(0.56146/(Data!V$24^2*'C&J'!E$15/(4*'C&J'!E$18*'C&J'!X51/1440)))","v":4.0529872636325415},261.96000000000004]
[null,null,null,null,null,null,null,null,null,null,null,null,null,44,{"$f":"IF(Data!L68>=E$9,Data!L68-E$10,0)","v":0},{"$f":"IF(O52>0,P51+7.48*Data!M68*(Data!B68-Data!B67)/1440,0)","v":0},{"$f":"IF(O52>0,Q51+7.48*(4*PI()*(E$16/1440)*Data!N68)*(Data!B68-Data!B67)/LN(0.56146/((Data!P68^2*'C&J'!E$15)/(4*('C&J'!E$16/1440)*O52))),0)","v":0},0,null,{"$f":"Data!L68","v":0},{"$f":"Data!M68/Data!N68","v":{"$error":"#N/A"}},null,43,254.84,{"$f":"4*PI()*E$18/LN(0.56146/(Data!V$24^2*'C&J'!E$15/(4*'C&J'!E$18*'C&J'!X52/1440)))","v":4.040818021337925},267.84000000000003]
[null,null,null,null,null,null,null,null,null,null,null,null,null,45,{"$f":"IF(Data!L69>=E$9,Data!L69-E$10,0)","v":0},{"$f":"IF(O53>0,P52+7.48*Data!M69*(Data!B69-Data!B68)/1440,0)","v":0},{"$f":"IF(O53>0,Q52+7.48*(4*PI()*(E$16/1440)*Data!N69)*(Data!B69-Data!B68)/LN(0.56146/((Data!P69^2*'C&J'!E$15)/(4*('C&J'!E$16/1440)*O53))),0)","v":0},0,null,{"$f":"Data!L69","v":0},{"$f":"Data!M69/Data!N69","v":{"$error":"#N/A"}},null,44,260.72000000000003,{"$f":"4*PI()*E$18/LN(0.56146/(Data!V$24^2*'C&J'!E$15/(4*'C&J'!E$18*'C&J'!X53/1440)))","v":4.0289967747254138},273.72000000000003]
[null,null,null,null,null,null,null,null,null,null,null,null,null,46,{"$f":"IF(Data!L70>=E$9,Data!L70-E$10,0)","v":0},{"$f":"IF(O54>0,P53+7.48*Data!M70*(Data!B70-Data!B69)/1440,0)","v":0},{"$f":"IF(O54>0,Q53+7.48*(4*PI()*(E$16/1440)*Data!N70)*(Data!B70-Data!B69)/LN(0.56146/((Data!P70^2*'C&J'!E$15)/(4*('C&J'!E$16/1440)*O54))),0)","v":0},0,null,{"$f":"Data!L70","v":0},{"$f":"Data!M70/Data!N70","v":{"$error":"#N/A"}},null,45,266.60000000000002,{"$f":"4*PI()*E$18/LN(0.56146/(Data!V$24^2*'C&J'!E$15/(4*'C&J'!E$18*'C&J'!X54/1440)))","v":4.0175058588558681},279.60000000000002]
[null,null,null,null,null,null,null,null,null,null,null,null,null,47,{"$f":"IF(Data!L71>=E$9,Data!L71-E$10,0)","v":0},{"$f":"IF(O55>0,P54+7.48*Data!M71*(Data!B71-Data!B70)/1440,0)","v":0},{"$f":"IF(O55>0,Q54+7.48*(4*PI()*(E$16/1440)*Data!N71)*(Data!B71-Data!B70)/LN(0.56146/((Data!P71^2*'C&J'!E$15)/(4*('C&J'!E$16/1440)*O55))),0)","v":0},0,null,{"$f":"Data!L71","v":0},{"$f":"Data!M71/Data!N71","v":{"$error":"#N/A"}},null,46,272.48,{"$f":"4*PI()*E$18/LN(0.56146/(Data!V$24^2*'C&J'!E$15/(4*'C&J'!E$18*'C&J'!X55/1440)))","v":4.0063288763949281},285.48]
[null,null,null,null,null,null,null,null,null,null,null,null,null,48,{"$f":"IF(Data!L72>=E$9,Data!L72-E$10,0)","v":0},{"$f":"IF(O56>0,P55+7.48*Data!M72*(Data!B72-Data!B71)/1440,0)","v":0},{"$f":"IF(O56>0,Q55+7.48*(4*PI()*(E$16/1440)*Data!N72)*(Data!B72-Data!B71)/LN(0.56146/((Data!P72^2*'C&J'!E$15)/(4*('C&J'!E$16/1440)*O56))),0)","v":0},0,null,{"$f":"Data!L72","v":0},{"$f":"Data!M72/Data!N72","v":{"$error":"#N/A"}},null,47,278.36,{"$f":"4*PI()*E$18/LN(0.56146/(Data!V$24^2*'C&J'!E$15/(4*'C&J'!E$18*'C&J'!X56/1440)))","v":3.9954505812814429},291.36]
[null,null,null,null,null,null,null,null,null,null,null,null,null,49,{"$f":"IF(Data!L73>=E$9,Data!L73-E$10,0)","v":0},{"$f":"IF(O57>0,P56+7.48*Data!M73*(Data!B73-Data!B72)/1440,0)","v":0},{"$f":"IF(O57>0,Q56+7.48*(4*PI()*(E$16/1440)*Data!N73)*(Data!B73-Data!B72)/LN(0.56146/((Data!P73^2*'C&J'!E$15)/(4*('C&J'!E$16/1440)*O57))),0)","v":0},0,null,{"$f":"Data!L73","v":0},{"$f":"Data!M73/Data!N73","v":{"$error":"#N/A"}},null,48,284.24,{"$f":"4*PI()*E$18/LN(0.56146/(Data!V$24^2*'C&J'!E$15/(4*'C&J'!E$18*'C&J'!X57/1440)))","v":3.984856775297438},297.24]
[null,null,null,null,null,null,null,null,null,null,null,null,null,50,{"$f":"IF(Data!L74>=E$9,Data!L74-E$10,0)","v":0},{"$f":"IF(O58>0,P57+7.48*Data!M74*(Data!B74-Data!B73)/1440,0)","v":0},{"$f":"IF(O58>0,Q57+7.48*(4*PI()*(E$16/1440)*Data!N74)*(Data!B74-Data!B73)/LN(0.56146/((Data!P74^2*'C&J'!E$15)/(4*('C&J'!E$16/1440)*O58))),0)","v":0},0,null,{"$f":"Data!L74","v":0},{"$f":"Data!M74/Data!N74","v":{"$error":"#N/A"}},null,49,290.12,{"$f":"4*PI()*E$18/LN(0.56146/(Data!V$24^2*'C&J'!E$15/(4*'C&J'!E$18*'C&J'!X58/1440)))","v":3.9745342158724801},303.12]
[null,null,null,null,null,null,null,null,null,null,null,null,null,null,null,null,null,null,null,{"$f":"Data!L75","v":0},{"$f":"Data!M75/Data!N75","v":{"$error":"#N/A"}},null,50,296,{"$f":"4*PI()*E$18/LN(0.56146/(Data!V$24^2*'C&J'!E$15/(4*'C&J'!E$18*'C&J'!X59/1440)))","v":3.964470533700017},309]
[null,null,null,null,null,null,null,null,null,null,null,null,null,null,null,null,null,null,null,{"$f":"Data!L76","v":0},{"$f":"Data!M76/Data!N76","v":{"$error":"#N/A"}}]
[null,null,null,null,null,null,null,null,null,null,null,null,null,null,null,null,null,null,null,{"$f":"Data!L77","v":0},{"$f":"Data!M77/Data!N77","v":{"$error":"#N/A"}}]
[null,null,null,null,null,null,null,null,null,null,null,null,null,null,null,null,null,null,null,{"$f":"Data!L78","v":0},{"$f":"Data!M78/Data!N78","v":{"$error":"#N/A"}}]
[null,null,null,null,null,null,null,null,null,null,null,null,null,null,null,null,null,null,null,{"$f":"Data!L79","v":0},{"$f":"Data!M79/Data!N79","v":{"$error":"#N/A"}}]
[null,null,null,null,null,null,null,null,null,null,null,null,null,null,null,null,null,null,null,{"$f":"Data!L80","v":0},{"$f":"Data!M80/Data!N80","v":{"$error":"#N/A"}}]
[null,null,null,null,null,null,null,null,null,null,null,null,null,null,null,null,null,null,null,{"$f":"Data!L81","v":0},{"$f":"Data!M81/Data!N81","v":{"$error":"#N/A"}}]
[null,null,null,null,null,null,null,null,null,null,null,null,null,null,null,null,null,null,null,{"$f":"Data!L82","v":0},{"$f":"Data!M82/Data!N82","v":{"$error":"#N/A"}}]

{"sheet":"CB&P","index":5,"n_rows":108,"n_cols":25,"rows_kept":108,"cut":false,"hidden":false,"merged":[]}
["Cooper, Bredehoeft and Papadopulos (1967)"]
["Well Designation:",null,{"$f":"IF(Data!B1 > 0,Data!B1,\"\")","v":"MW16"},null,null,null,null,null,null,null,null,null,null,null,null,"e",9.9999999999999995E-7]
["Date:",null,{"$f":"IF(Data!B2 > 0,Data!B2,\"\")","v":"2021-11-09"}]
[]
[null,"Enter early time cut-off for least-squares model fit"]
[null,null,"Timecut (min):",null,0,"<-  Enter or change values here",null,null,null,null,null,null,null,"Count","Time ","H/Ho","G (a,b,e)","SE",null,null,null,null,null,"Time ","H/Ho"]
[null,"Initial Drawdown sn (ft):",null,null,0,null,null,null,null,null,null,null,null,null,"(min)",null,null,null,null,"Index","Time (min)","G( )",null,"(min)"]
[null,null,null,null,null,null,null,null,null,null,null,null,null,{"$f":"IF(O8>0,1,0)","v":1},{"$f":"IF(Data!B24>E$6,Data!B24-E$6,0)","v":1},{"$f":"IF(N8>0,Data!J24/'CB&P'!E$7,0)","v":{"$error":"#DIV/0!"}},{"$f":"IF(N8>0,G(E$14,((-J$20)*'CB&P'!E$13/1440)*'CB&P'!O8/Data!V$24^2,'CB&P'!Q$2),0)","v":{"$error":"#VALUE!"}},{"$f":"N8*(P8-Q8)^2","v":{"$error":"#DIV/0!"}},null,0,{"$f":"EXP(LN(J$15)+(LN(J$16)-LN(J$15))*T8/100)","v":3.0000000000000004},{"$f":"G('CB&P'!E$14,((-J$20)*'CB&P'!E$13/1440)*'CB&P'!U8/Data!V$24^2,0.00001)","v":{"$error":"#VALUE!"}},null,{"$f":"IF(N8>0,O8,NA())","v":1},{"$f":"IF(N8>0,P8,NA())","v":{"$error":"#DIV/0!"}}]
[null,"Trial Sn:",null,null,"d","<-- Enter d for default",null,null,null,null,null,null,null,{"$f":"IF(O9>0,1,0)","v":1},{"$f":"IF(Data!B25>E$6,Data!B25-E$6,0)","v":3},{"$f":"IF(N9>0,Data!J25/'CB&P'!E$7,0)","v":{"$error":"#DIV/0!"}},{"$f":"IF(N9>0,G(E$14,((-J$20)*'CB&P'!E$13/1440)*'CB&P'!O9/Data!V$24^2,'CB&P'!Q$2),0)","v":{"$error":"#VALUE!"}},{"$f":"N9*(P9-Q9)^2","v":{"$error":"#DIV/0!"}},null,1,3.1330499620379677,{"$f":"G('CB&P'!E$14,((-J$20)*'CB&P'!E$13/1440)*'CB&P'!U9/Data!V$24^2,0.00001)","v":{"$error":"#VALUE!"}},null,{"$f":"IF(N9>0,O9,NA())","v":3},{"$f":"IF(N9>0,P9,NA())","v":{"$error":"#DIV/0!"}}]
[null,null,null,null,null,null,null,null,null,null,null,null,null,1,{"$f":"IF(Data!B26>E$6,Data!B26-E$6,0)","v":4},{"$f":"IF(N10>0,Data!J26/'CB&P'!E$7,0)","v":{"$error":"#DIV/0!"}},{"$f":"IF(N10>0,G(E$14,((-J$20)*'CB&P'!E$13/1440)*'CB&P'!O10/Data!V$24^2,'CB&P'!Q$2),0)","v":{"$error":"#VALUE!"}},{"$error":"#DIV/0!"},null,2,3.2720006882087023,{"$f":"G('CB&P'!E$14,((-J$20)*'CB&P'!E$13/1440)*'CB&P'!U10/Data!V$24^2,0.00001)","v":{"$error":"#VALUE!"}},null,4,{"$error":"#DIV/0!"}]
[null,"Root-Mean-Square Error:",null,null,{"$f":"SQRT(SUM(R8:R48))","v":{"$error":"#DIV/0!"}},"<-- Minimize this using \"Solver\"",null,null,null,null,null,null,null,1,{"$f":"IF(Data!B27>E$6,Data!B27-E$6,0)","v":5},{"$f":"IF(N11>0,Data!J27/'CB&P'!E$7,0)","v":{"$error":"#DIV/0!"}},{"$f":"IF(N11>0,G(E$14,((-J$20)*'CB&P'!E$13/1440)*'CB&P'!O11/Data!V$24^2,'CB&P'!Q$2),0)","v":{"$error":"#VALUE!"}},{"$error":"#DIV/0!"},null,3,3.4171138773268255,{"$f":"G('CB&P'!E$14,((-J$20)*'CB&P'!E$13/1440)*'CB&P'!U11/Data!V$24^2,0.00001)","v":{"$error":"#VALUE!"}},null,5,{"$error":"#DIV/0!"}]
[null,null,null,null,null,null,null,null,null,null,null,null,null,1,{"$f":"IF(Data!B28>E$6,Data!B28-E$6,0)","v":6},{"$f":"IF(N12>0,Data!J28/'CB&P'!E$7,0)","v":{"$error":"#DIV/0!"}},{"$f":"IF(N12>0,G(E$14,((-J$20)*'CB&P'!E$13/1440)*'CB&P'!O12/Data!V$24^2,'CB&P'!Q$2),0)","v":{"$error":"#VALUE!"}},{"$error":"#DIV/0!"},null,4,3.5686628345460734,{"$f":"G('CB&P'!E$14,((-J$20)*'CB&P'!E$13/1440)*'CB&P'!U12/Data!V$24^2,0.00001)","v":{"$error":"#VALUE!"}},null,6,{"$error":"#DIV/0!"}]
[null,"Trial Tn (ft2/d):",null,null,2.5,"<-- By changing Tn through \"Solver\"",null,null,null,null,null,null,null,1,{"$f":"IF(Data!B29>E$6,Data!B29-E$6,0)","v":7},{"$f":"IF(N13>0,Data!J29/'CB&P'!E$7,0)","v":{"$error":"#DIV/0!"}},{"$f":"IF(N13>0,G(E$14,((-J$20)*'CB&P'!E$13/1440)*'CB&P'!O13/Data!V$24^2,'CB&P'!Q$2),0)","v":{"$error":"#VALUE!"}},{"$error":"#DIV/0!"},null,5,3.7269329861002931,{"$f":"G('CB&P'!E$14,((-J$20)*'CB&P'!E$13/1440)*'CB&P'!U13/Data!V$24^2,0.00001)","v":{"$error":"#VALUE!"}},null,7,{"$error":"#DIV/0!"}]
[null,null,null,null,{"$f":"IF(E9=\"d\",0.025*SQRT(E13),E9)","v":3.952847075210475E-2},"<-- Working Sn",null,"Add constraint Tn > 0.00001",null,null,null,null,null,1,{"$f":"IF(Data!B30>E$6,Data!B30-E$6,0)","v":8},{"$f":"IF(N14>0,Data!J30/'CB&P'!E$7,0)","v":{"$error":"#DIV/0!"}},{"$f":"IF(N14>0,G(E$14,((-J$20)*'CB&P'!E$13/1440)*'CB&P'!O14/Data!V$24^2,'CB&P'!Q$2),0)","v":{"$error":"#VALUE!"}},{"$error":"#DIV/0!"},null,6,3.8922224168731896,{"$f":"G('CB&P'!E$14,((-J$20)*'CB&P'!E$13/1440)*'CB&P'!U14/Data!V$24^2,0.00001)","v":{"$error":"#VALUE!"}},null,8,{"$error":"#DIV/0!"}]
[null,"Model Result:",null,"Tn (ft2/d) =",{"$f":"E13","v":2.5},null,null,null,"Tmin",3,null,null,null,1,{"$f":"IF(Data!B31>E$6,Data!B31-E$6,0)","v":9},{"$f":"IF(N15>0,Data!J31/'CB&P'!E$7,0)","v":{"$error":"#DIV/0!"}},{"$f":"IF(N15>0,G(E$14,((-J$20)*'CB&P'!E$13/1440)*'CB&P'!O15/Data!V$24^2,'CB&P'!Q$2),0)","v":{"$error":"#VALUE!"}},{"$error":"#DIV/0!"},null,7,4.0648424318092902,{"$f":"G('CB&P'!E$14,((-J$20)*'CB&P'!E$13/1440)*'CB&P'!U15/Data!V$24^2,0.00001)","v":{"$error":"#VALUE!"}},null,9,{"$error":"#DIV/0!"}]
[null,null,null,null,null,null,null,null,"Tmax",230,null,null,null,1,{"$f":"IF(Data!B32>E$6,Data!B32-E$6,0)","v":10},{"$f":"IF(N16>0,Data!J32/'CB&P'!E$7,0)","v":{"$error":"#DIV/0!"}},{"$f":"IF(N16>0,G(E$14,((-J$20)*'CB&P'!E$13/1440)*'CB&P'!O16/Data!V$24^2,'CB&P'!Q$2),0)","v":{"$error":"#VALUE!"}},{"$error":"#DIV/0!"},null,8,4.2451181422234718,{"$f":"G('CB&P'!E$14,((-J$20)*'CB&P'!E$13/1440)*'CB&P'!U16/Data!V$24^2,0.00001)","v":{"$error":"#VALUE!"}},null,10,{"$error":"#DIV/0!"}]
[null,null,null,null,null,null,null,null,null,null,null,null,null,1,{"$f":"IF(Data!B33>E$6,Data!B33-E$6,0)","v":11},{"$f":"IF(N17>0,Data!J33/'CB&P'!E$7,0)","v":{"$error":"#DIV/0!"}},{"$f":"IF(N17>0,G(E$14,((-J$20)*'CB&P'!E$13/1440)*'CB&P'!O17/Data!V$24^2,'CB&P'!Q$2),0)","v":{"$error":"#VALUE!"}},{"$error":"#DIV/0!"},null,9,4.4333890781133114,{"$f":"G('CB&P'!E$14,((-J$20)*'CB&P'!E$13/1440)*'CB&P'!U17/Data!V$24^2,0.00001)","v":{"$error":"#VALUE!"}},null,11,{"$error":"#DIV/0!"}]
[null,null,null,null,null,null,null,null,null,null,null,null,null,1,{"$f":"IF(Data!B34>E$6,Data!B34-E$6,0)","v":13},{"$f":"IF(N18>0,Data!J34/'CB&P'!E$7,0)","v":{"$error":"#DIV/0!"}},{"$f":"IF(N18>0,G(E$14,((-J$20)*'CB&P'!E$13/1440)*'CB&P'!O18/Data!V$24^2,'CB&P'!Q$2),0)","v":{"$error":"#VALUE!"}},{"$error":"#DIV/0!"},null,10,4.6300098276274824,{"$f":"G('CB&P'!E$14,((-J$20)*'CB&P'!E$13/1440)*'CB&P'!U18/Data!V$24^2,0.00001)","v":{"$error":"#VALUE!"}},null,13,{"$error":"#DIV/0!"}]
[null,null,null,null,null,null,null,null,null,"J-Ratio",null,null,null,1,{"$f":"IF(Data!B35>E$6,Data!B35-E$6,0)","v":15},{"$f":"IF(N19>0,Data!J35/'CB&P'!E$7,0)","v":{"$error":"#DIV/0!"}},{"$f":"IF(N19>0,G(E$14,((-J$20)*'CB&P'!E$13/1440)*'CB&P'!O19/Data!V$24^2,'CB&P'!Q$2),0)","v":{"$error":"#VALUE!"}},{"$error":"#DIV/0!"},null,11,4.835350704894565,{"$f":"G('CB&P'!E$14,((-J$20)*'CB&P'!E$13/1440)*'CB&P'!U19/Data!V$24^2,0.00001)","v":{"$error":"#VALUE!"}},null,15,{"$error":"#DIV/0!"}]
[null,null,null,null,null,null,null,null,null,{"$f":"Figures!U27","v":{"$error":"#DIV/0!"}},null,null,null,1,{"$f":"IF(Data!B36>E$6,Data!B36-E$6,0)","v":17},{"$f":"IF(N20>0,Data!J36/'CB&P'!E$7,0)","v":{"$error":"#DIV/0!"}},{"$f":"IF(N20>0,G(E$14,((-J$20)*'CB&P'!E$13/1440)*'CB&P'!O20/Data!V$24^2,'CB&P'!Q$2),0)","v":{"$error":"#VALUE!"}},{"$error":"#DIV/0!"},null,12,5.0497984474700583,{"$f":"G('CB&P'!E$14,((-J$20)*'CB&P'!E$13/1440)*'CB&P'!U20/Data!V$24^2,0.00001)","v":{"$error":"#VALUE!"}},null,17,{"$error":"#DIV/0!"}]
[null,null,null,null,null,null,null,null,null,null,null,null,null,1,{"$f":"IF(Data!B37>E$6,Data!B37-E$6,0)","v":19},{"$f":"IF(N21>0,Data!J37/'CB&P'!E$7,0)","v":{"$error":"#DIV/0!"}},{"$f":"IF(N21>0,G(E$14,((-J$20)*'CB&P'!E$13/1440)*'CB&P'!O21/Data!V$24^2,'CB&P'!Q$2),0)","v":{"$error":"#VALUE!"}},{"$error":"#DIV/0!"},null,13,5.2737569447151511,{"$f":"G('CB&P'!E$14,((-J$20)*'CB&P'!E$13/1440)*'CB&P'!U21/Data!V$24^2,0.00001)","v":{"$error":"#VALUE!"}},null,19,{"$error":"#DIV/0!"}]
[null,null,null,null,null,null,null,null,null,null,null,null,null,1,{"$f":"IF(Data!B38>E$6,Data!B38-E$6,0)","v":21},{"$f":"IF(N22>0,Data!J38/'CB&P'!E$7,0)","v":{"$error":"#DIV/0!"}},{"$f":"IF(N22>0,G(E$14,((-J$20)*'CB&P'!E$13/1440)*'CB&P'!O22/Data!V$24^2,'CB&P'!Q$2),0)","v":{"$error":"#VALUE!"}},{"$error":"#DIV/0!"},null,14,5.50764799847909,{"$f":"G('CB&P'!E$14,((-J$20)*'CB&P'!E$13/1440)*'CB&P'!U22/Data!V$24^2,0.00001)","v":{"$error":"#VALUE!"}},null,21,{"$error":"#DIV/0!"}]
[null,null,null,null,null,null,null,null,null,null,null,null,null,1,{"$f":"IF(Data!B39>E$6,Data!B39-E$6,0)","v":31},{"$f":"IF(N23>0,Data!J39/'CB&P'!E$7,0)","v":{"$error":"#DIV/0!"}},{"$f":"IF(N23>0,G(E$14,((-J$20)*'CB&P'!E$13/1440)*'CB&P'!O23/Data!V$24^2,'CB&P'!Q$2),0)","v":{"$error":"#VALUE!"}},{"$error":"#DIV/0!"},null,15,5.7519121175177981,{"$f":"G('CB&P'!E$14,((-J$20)*'CB&P'!E$13/1440)*'CB&P'!U23/Data!V$24^2,0.00001)","v":{"$error":"#VALUE!"}},null,31,{"$error":"#DIV/0!"}]
[null,null,null,null,null,null,null,null,null,null,null,null,null,1,{"$f":"IF(Data!B40>E$6,Data!B40-E$6,0)","v":41},{"$f":"IF(N24>0,Data!J40/'CB&P'!E$7,0)","v":{"$error":"#DIV/0!"}},{"$f":"IF(N24>0,G(E$14,((-J$20)*'CB&P'!E$13/1440)*'CB&P'!O24/Data!V$24^2,'CB&P'!Q$2),0)","v":{"$error":"#VALUE!"}},{"$error":"#DIV/0!"},null,16,6.0070093471449519,{"$f":"G('CB&P'!E$14,((-J$20)*'CB&P'!E$13/1440)*'CB&P'!U24/Data!V$24^2,0.00001)","v":{"$error":"#VALUE!"}},null,41,{"$error":"#DIV/0!"}]
[null,null,null,null,null,null,null,null,null,null,null,null,null,1,{"$f":"IF(Data!B41>E$6,Data!B41-E$6,0)","v":51},{"$f":"IF(N25>0,Data!J41/'CB&P'!E$7,0)","v":{"$error":"#DIV/0!"}},{"$f":"IF(N25>0,G(E$14,((-J$20)*'CB&P'!E$13/1440)*'CB&P'!O25/Data!V$24^2,'CB&P'!Q$2),0)","v":{"$error":"#VALUE!"}},{"$error":"#DIV/0!"},null,17,6.2734201356780694,{"$f":"G('CB&P'!E$14,((-J$20)*'CB&P'!E$13/1440)*'CB&P'!U25/Data!V$24^2,0.00001)","v":{"$error":"#VALUE!"}},null,51,{"$error":"#DIV/0!"}]
[null,null,null,null,null,null,null,null,null,null,null,null,null,1,{"$f":"IF(Data!B42>E$6,Data!B42-E$6,0)","v":61},{"$f":"IF(N26>0,Data!J42/'CB&P'!E$7,0)","v":{"$error":"#DIV/0!"}},{"$f":"IF(N26>0,G(E$14,((-J$20)*'CB&P'!E$13/1440)*'CB&P'!O26/Data!V$24^2,'CB&P'!Q$2),0)","v":{"$error":"#VALUE!"}},{"$error":"#DIV/0!"},null,18,6.5516462393114647,{"$f":"G('CB&P'!E$14,((-J$20)*'CB&P'!E$13/1440)*'CB&P'!U26/Data!V$24^2,0.00001)","v":{"$error":"#VALUE!"}},null,61,{"$error":"#DIV/0!"}]
[null,null,null,null,null,null,null,null,null,null,null,null,null,1,{"$f":"IF(Data!B43>E$6,Data!B43-E$6,0)","v":71},{"$f":"IF(N27>0,Data!J43/'CB&P'!E$7,0)","v":{"$error":"#DIV/0!"}},{"$f":"IF(N27>0,G(E$14,((-J$20)*'CB&P'!E$13/1440)*'CB&P'!O27/Data!V$24^2,'CB&P'!Q$2),0)","v":{"$error":"#VALUE!"}},{"$f":"N27*(P27-Q27)^2","v":{"$error":"#DIV/0!"}},null,19,6.842211667120325,{"$f":"G('CB&P'!E$14,((-J$20)*'CB&P'!E$13/1440)*'CB&P'!U27/Data!V$24^2,0.00001)","v":{"$error":"#VALUE!"}},null,71,{"$error":"#DIV/0!"}]
[null,null,null,null,null,null,null,null,null,null,null,null,null,1,{"$f":"IF(Data!B44>E$6,Data!B44-E$6,0)","v":81},{"$f":"IF(N28>0,Data!J44/'CB&P'!E$7,0)","v":{"$error":"#DIV/0!"}},{"$f":"IF(N28>0,G(E$14,((-J$20)*'CB&P'!E$13/1440)*'CB&P'!O28/Data!V$24^2,'CB&P'!Q$2),0)","v":{"$error":"#VALUE!"}},{"$f":"N28*(P28-Q28)^2","v":{"$error":"#DIV/0!"}},null,20,7.1456636679756889,{"$f":"G('CB&P'!E$14,((-J$20)*'CB&P'!E$13/1440)*'CB&P'!U28/Data!V$24^2,0.00001)","v":{"$error":"#VALUE!"}},null,81,{"$error":"#DIV/0!"}]
[null,null,null,null,null,null,null,null,null,null,null,null,null,1,{"$f":"IF(Data!B45>E$6,Data!B45-E$6,0)","v":91},{"$f":"IF(N29>0,Data!J45/'CB&P'!E$7,0)","v":{"$error":"#DIV/0!"}},{"$f":"IF(N29>0,G(E$14,((-J$20)*'CB&P'!E$13/1440)*'CB&P'!O29/Data!V$24^2,'CB&P'!Q$2),0)","v":{"$error":"#VALUE!"}},{"$error":"#DIV/0!"},null,21,7.4625737612291028,{"$f":"G('CB&P'!E$14,((-J$20)*'CB&P'!E$13/1440)*'CB&P'!U29/Data!V$24^2,0.00001)","v":{"$error":"#VALUE!"}},null,91,{"$error":"#DIV/0!"}]
[null,null,null,null,null,null,null,null,null,null,null,null,null,1,{"$f":"IF(Data!B46>E$6,Data!B46-E$6,0)","v":121},{"$f":"IF(N30>0,Data!J46/'CB&P'!E$7,0)","v":{"$error":"#DIV/0!"}},{"$f":"IF(N30>0,G(E$14,((-J$20)*'CB&P'!E$13/1440)*'CB&P'!O30/Data!V$24^2,'CB&P'!Q$2),0)","v":{"$error":"#VALUE!"}},{"$error":"#DIV/0!"},null,22,7.7935388131081238,{"$f":"G('CB&P'!E$14,((-J$20)*'CB&P'!E$13/1440)*'CB&P'!U30/Data!V$24^2,0.00001)","v":{"$error":"#VALUE!"}},null,121,{"$error":"#DIV/0!"}]
[null,null,null,null,null,null,null,null,null,null,null,null,null,1,{"$f":"IF(Data!B47>E$6,Data!B47-E$6,0)","v":151},{"$f":"IF(N31>0,Data!J47/'CB&P'!E$7,0)","v":{"$error":"#DIV/0!"}},{"$f":"IF(N31>0,G(E$14,((-J$20)*'CB&P'!E$13/1440)*'CB&P'!O31/Data!V$24^2,'CB&P'!Q$2),0)","v":{"$error":"#VALUE!"}},{"$error":"#DIV/0!"},null,23,8.1391821608499431,{"$f":"G('CB&P'!E$14,((-J$20)*'CB&P'!E$13/1440)*'CB&P'!U31/Data!V$24^2,0.00001)","v":{"$error":"#VALUE!"}},null,151,{"$error":"#DIV/0!"}]
[null,null,null,null,null,null,null,null,null,null,null,null,null,1,{"$f":"IF(Data!B48>E$6,Data!B48-E$6,0)","v":181},{"$f":"IF(N32>0,Data!J48/'CB&P'!E$7,0)","v":{"$error":"#DIV/0!"}},{"$f":"IF(N32>0,G(E$14,((-J$20)*'CB&P'!E$13/1440)*'CB&P'!O32/Data!V$24^2,'CB&P'!Q$2),0)","v":{"$error":"#VALUE!"}},{"$error":"#DIV/0!"},null,24,8.5001547866903344,{"$f":"G('CB&P'!E$14,((-J$20)*'CB&P'!E$13/1440)*'CB&P'!U32/Data!V$24^2,0.00001)","v":{"$error":"#VALUE!"}},null,181,{"$error":"#DIV/0!"}]
[null,null,null,null,null,null,null,null,null,null,null,null,null,1,{"$f":"IF(Data!B49>E$6,Data!B49-E$6,0)","v":211},{"$f":"IF(N33>0,Data!J49/'CB&P'!E$7,0)","v":{"$error":"#DIV/0!"}},{"$f":"IF(N33>0,G(E$14,((-J$20)*'CB&P'!E$13/1440)*'CB&P'!O33/Data!V$24^2,'CB&P'!Q$2),0)","v":{"$error":"#VALUE!"}},{"$error":"#DIV/0!"},null,25,8.8771365439190042,{"$f":"G('CB&P'!E$14,((-J$20)*'CB&P'!E$13/1440)*'CB&P'!U33/Data!V$24^2,0.00001)","v":{"$error":"#VALUE!"}},null,211,{"$error":"#DIV/0!"}]
[null,null,null,null,null,null,null,null,null,null,null,null,null,1,{"$f":"IF(Data!B50>E$6,Data!B50-E$6,0)","v":241},{"$f":"IF(N34>0,Data!J50/'CB&P'!E$7,0)","v":{"$error":"#DIV/0!"}},{"$f":"IF(N34>0,G(E$14,((-J$20)*'CB&P'!E$13/1440)*'CB&P'!O34/Data!V$24^2,'CB&P'!Q$2),0)","v":{"$error":"#VALUE!"}},{"$error":"#DIV/0!"},null,26,9.2708374373104245,{"$f":"G('CB&P'!E$14,((-J$20)*'CB&P'!E$13/1440)*'CB&P'!U34/Data!V$24^2,0.00001)","v":{"$error":"#VALUE!"}},null,241,{"$error":"#DIV/0!"}]
[null,null,null,null,null,null,null,null,null,null,null,null,null,1,{"$f":"IF(Data!B51>E$6,Data!B51-E$6,0)","v":271},{"$f":"IF(N35>0,Data!J51/'CB&P'!E$7,0)","v":{"$error":"#DIV/0!"}},{"$f":"IF(N35>0,G(E$14,((-J$20)*'CB&P'!E$13/1440)*'CB&P'!O35/Data!V$24^2,'CB&P'!Q$2),0)","v":{"$error":"#VALUE!"}},{"$error":"#DIV/0!"},null,27,9.681998960341863,{"$f":"G('CB&P'!E$14,((-J$20)*'CB&P'!E$13/1440)*'CB&P'!U35/Data!V$24^2,0.00001)","v":{"$error":"#VALUE!"}},null,271,{"$error":"#DIV/0!"}]
[null,null,null,null,null,null,null,null,null,null,null,null,null,1,{"$f":"IF(Data!B52>E$6,Data!B52-E$6,0)","v":301},{"$f":"IF(N36>0,Data!J52/'CB&P'!E$7,0)","v":{"$error":"#DIV/0!"}},{"$f":"IF(N36>0,G(E$14,((-J$20)*'CB&P'!E$13/1440)*'CB&P'!O36/Data!V$24^2,'CB&P'!Q$2),0)","v":{"$error":"#VALUE!"}},{"$error":"#DIV/0!"},null,28,10.111395491716904,{"$f":"G('CB&P'!E$14,((-J$20)*'CB&P'!E$13/1440)*'CB&P'!U36/Data!V$24^2,0.00001)","v":{"$error":"#VALUE!"}},null,301,{"$error":"#DIV/0!"}]
[null,null,null,null,null,null,null,null,null,null,null,null,null,0,{"$f":"IF(Data!B53>E$6,Data!B53-E$6,0)","v":0},{"$f":"IF(N37>0,Data!J53/'CB&P'!E$7,0)","v":0},{"$f":"IF(N37>0,G(E$14,((-J$20)*'CB&P'!E$13/1440)*'CB&P'!O37/Data!V$24^2,'CB&P'!Q$2),0)","v":0},0,null,29,10.559835753824835,{"$f":"G('CB&P'!E$14,((-J$20)*'CB&P'!E$13/1440)*'CB&P'!U37/Data!V$24^2,0.00001)","v":{"$error":"#VALUE!"}},null,{"$error":"#N/A"},{"$error":"#N/A"}]
[null,null,null,null,null,null,null,null,null,null,null,null,null,0,{"$f":"IF(Data!B54>E$6,Data!B54-E$6,0)","v":0},{"$f":"IF(N38>0,Data!J54/'CB&P'!E$7,0)","v":0},{"$f":"IF(N38>0,G(E$14,((-J$20)*'CB&P'!E$13/1440)*'CB&P'!O38/Data!V$24^2,'CB&P'!Q$2),0)","v":0},0,null,30,11.028164335882694,{"$f":"G('CB&P'!E$14,((-J$20)*'CB&P'!E$13/1440)*'CB&P'!U38/Data!V$24^2,0.00001)","v":{"$error":"#VALUE!"}},null,{"$error":"#N/A"},{"$error":"#N/A"}]
[null,null,null,null,null,null,null,null,null,null,null,null,null,0,{"$f":"IF(Data!B55>E$6,Data!B55-E$6,0)","v":0},{"$f":"IF(N39>0,Data!J55/'CB&P'!E$7,0)","v":0},{"$f":"IF(N39>0,G(E$14,((-J$20)*'CB&P'!E$13/1440)*'CB&P'!O39/Data!V$24^2,'CB&P'!Q$2),0)","v":0},0,null,31,11.517263284628575,{"$f":"G('CB&P'!E$14,((-J$20)*'CB&P'!E$13/1440)*'CB&P'!U39/Data!V$24^2,0.00001)","v":{"$error":"#VALUE!"}},null,{"$error":"#N/A"},{"$error":"#N/A"}]
[null,null,null,null,null,null,null,null,null,null,null,null,null,0,{"$f":"IF(Data!B56>E$6,Data!B56-E$6,0)","v":0},{"$f":"IF(N40>0,Data!J56/'CB&P'!E$7,0)","v":0},{"$f":"IF(N40>0,G(E$14,((-J$20)*'CB&P'!E$13/1440)*'CB&P'!O40/Data!V$24^2,'CB&P'!Q$2),0)","v":0},0,null,32,{"$f":"EXP(LN(J$15)+(LN(J$16)-LN(J$15))*T40/100)","v":12.028053765562277},{"$f":"G('CB&P'!E$14,((-J$20)*'CB&P'!E$13/1440)*'CB&P'!U40/Data!V$24^2,0.00001)","v":{"$error":"#VALUE!"}},null,{"$error":"#N/A"},{"$error":"#N/A"}]
[null,null,null,null,null,null,null,null,null,null,null,null,null,0,{"$f":"IF(Data!B57>E$6,Data!B57-E$6,0)","v":0},{"$f":"IF(N41>0,Data!J57/'CB&P'!E$7,0)","v":0},{"$f":"IF(N41>0,G(E$14,((-J$20)*'CB&P'!E$13/1440)*'CB&P'!O41/Data!V$24^2,'CB&P'!Q$2),0)","v":0},0,null,33,12.56149779786184,{"$f":"G('CB&P'!E$14,((-J$20)*'CB&P'!E$13/1440)*'CB&P'!U41/Data!V$24^2,0.00001)","v":{"$error":"#VALUE!"}},null,{"$error":"#N/A"},{"$error":"#N/A"}]
[null,null,null,null,null,null,null,null,null,null,null,null,null,0,{"$f":"IF(Data!B58>E$6,Data!B58-E$6,0)","v":0},{"$f":"IF(N42>0,Data!J58/'CB&P'!E$7,0)","v":0},{"$f":"IF(N42>0,G(E$14,((-J$20)*'CB&P'!E$13/1440)*'CB&P'!O42/Data!V$24^2,'CB&P'!Q$2),0)","v":0},0,null,34,13.118600066243676,{"$f":"G('CB&P'!E$14,((-J$20)*'CB&P'!E$13/1440)*'CB&P'!U42/Data!V$24^2,0.00001)","v":{"$error":"#VALUE!"}},null,{"$error":"#N/A"},{"$error":"#N/A"}]
[null,null,null,null,null,null,null,null,null,null,null,null,null,0,{"$f":"IF(Data!B59>E$6,Data!B59-E$6,0)","v":0},{"$f":"IF(N43>0,Data!J59/'CB&P'!E$7,0)","v":0},{"$f":"IF(N43>0,G(E$14,((-J$20)*'CB&P'!E$13/1440)*'CB&P'!O43/Data!V$24^2,'CB&P'!Q$2),0)","v":0},0,null,35,13.700409813178682,{"$f":"G('CB&P'!E$14,((-J$20)*'CB&P'!E$13/1440)*'CB&P'!U43/Data!V$24^2,0.00001)","v":{"$error":"#VALUE!"}},null,{"$error":"#N/A"},{"$error":"#N/A"}]
[null,null,null,null,null,null,null,null,null,null,null,null,null,0,{"$f":"IF(Data!B60>E$6,Data!B60-E$6,0)","v":0},{"$f":"IF(N44>0,Data!J60/'CB&P'!E$7,0)","v":0},{"$f":"IF(N44>0,G(E$14,((-J$20)*'CB&P'!E$13/1440)*'CB&P'!O44/Data!V$24^2,'CB&P'!Q$2),0)","v":0},0,null,36,14.308022815028014,{"$f":"G('CB&P'!E$14,((-J$20)*'CB&P'!E$13/1440)*'CB&P'!U44/Data!V$24^2,0.00001)","v":{"$error":"#VALUE!"}},null,{"$error":"#N/A"},{"$error":"#N/A"}]
[null,null,null,null,null,null,null,null,null,null,null,null,null,0,{"$f":"IF(Data!B61>E$6,Data!B61-E$6,0)","v":0},{"$f":"IF(N45>0,Data!J61/'CB&P'!E$7,0)","v":0},{"$f":"IF(N45>0,G(E$14,((-J$20)*'CB&P'!E$13/1440)*'CB&P'!O45/Data!V$24^2,'CB&P'!Q$2),0)","v":0},0,null,37,14.942583445820629,{"$f":"G('CB&P'!E$14,((-J$20)*'CB&P'!E$13/1440)*'CB&P'!U45/Data!V$24^2,0.00001)","v":{"$error":"#VALUE!"}},null,{"$error":"#N/A"},{"$error":"#N/A"}]
[null,null,null,null,null,null,null,null,null,null,null,null,null,0,{"$f":"IF(Data!B62>E$6,Data!B62-E$6,0)","v":0},{"$f":"IF(N46>0,Data!J62/'CB&P'!E$7,0)","v":0},{"$f":"IF(N46>0,G(E$14,((-J$20)*'CB&P'!E$13/1440)*'CB&P'!O46/Data!V$24^2,'CB&P'!Q$2),0)","v":0},0,null,38,15.605286832559161,{"$f":"G('CB&P'!E$14,((-J$20)*'CB&P'!E$13/1440)*'CB&P'!U46/Data!V$24^2,0.00001)","v":{"$error":"#VALUE!"}},null,{"$error":"#N/A"},{"$error":"#N/A"}]
[null,null,null,null,null,null,null,null,null,null,null,null,null,0,{"$f":"IF(Data!B63>E$6,Data!B63-E$6,0)","v":0},{"$f":"IF(N47>0,Data!J63/'CB&P'!E$7,0)","v":0},{"$f":"IF(N47>0,G(E$14,((-J$20)*'CB&P'!E$13/1440)*'CB&P'!O47/Data!V$24^2,'CB&P'!Q$2),0)","v":0},0,null,39,16.297381106113683,{"$f":"G('CB&P'!E$14,((-J$20)*'CB&P'!E$13/1440)*'CB&P'!U47/Data!V$24^2,0.00001)","v":{"$error":"#VALUE!"}},null,{"$error":"#N/A"},{"$error":"#N/A"}]
[null,null,null,null,null,null,null,null,null,null,null,null,null,0,{"$f":"IF(Data!B64>E$6,Data!B64-E$6,0)","v":0},{"$f":"IF(N48>0,Data!J64/'CB&P'!E$7,0)","v":0},{"$f":"IF(N48>0,G(E$14,((-J$20)*'CB&P'!E$13/1440)*'CB&P'!O48/Data!V$24^2,'CB&P'!Q$2),0)","v":0},0,null,40,17.020169751942593,{"$f":"G('CB&P'!E$14,((-J$20)*'CB&P'!E$13/1440)*'CB&P'!U48/Data!V$24^2,0.00001)","v":{"$error":"#VALUE!"}},null,{"$error":"#N/A"},{"$error":"#N/A"}]
[null,null,null,null,null,null,null,null,null,null,null,null,null,null,null,null,null,null,null,41,17.775014065067825,{"$f":"G('CB&P'!E$14,((-J$20)*'CB&P'!E$13/1440)*'CB&P'!U49/Data!V$24^2,0.00001)","v":{"$error":"#VALUE!"}}]
[null,null,null,null,null,null,null,null,null,null,null,null,null,null,null,null,null,null,null,42,18.56333571392836,{"$f":"G('CB&P'!E$14,((-J$20)*'CB&P'!E$13/1440)*'CB&P'!U50/Data!V$24^2,0.00001)","v":{"$error":"#VALUE!"}}]
[null,null,null,null,null,null,null,null,null,null,null,null,null,null,null,null,null,null,null,43,19.38661941794043,{"$f":"G('CB&P'!E$14,((-J$20)*'CB&P'!E$13/1440)*'CB&P'!U51/Data!V$24^2,0.00001)","v":{"$error":"#VALUE!"}}]
[null,null,null,null,null,null,null,null,null,null,null,null,null,null,null,null,null,null,null,44,20.246415743807585,{"$f":"G('CB&P'!E$14,((-J$20)*'CB&P'!E$13/1440)*'CB&P'!U52/Data!V$24^2,0.00001)","v":{"$error":"#VALUE!"}}]
[null,null,null,null,null,null,null,null,null,null,null,null,null,null,null,null,null,null,null,45,21.144344025847097,{"$f":"G('CB&P'!E$14,((-J$20)*'CB&P'!E$13/1440)*'CB&P'!U53/Data!V$24^2,0.00001)","v":{"$error":"#VALUE!"}}]
[null,null,null,null,null,null,null,null,null,null,null,null,null,null,null,null,null,null,null,46,22.082095415832644,{"$f":"G('CB&P'!E$14,((-J$20)*'CB&P'!E$13/1440)*'CB&P'!U54/Data!V$24^2,0.00001)","v":{"$error":"#VALUE!"}}]
[null,null,null,null,null,null,null,null,null,null,null,null,null,null,null,null,null,null,null,47,23.061436068097755,{"$f":"G('CB&P'!E$14,((-J$20)*'CB&P'!E$13/1440)*'CB&P'!U55/Data!V$24^2,0.00001)","v":{"$error":"#VALUE!"}}]
[null,null,null,null,null,null,null,null,null,null,null,null,null,null,null,null,null,null,null,48,24.084210465898217,{"$f":"G('CB&P'!E$14,((-J$20)*'CB&P'!E$13/1440)*'CB&P'!U56/Data!V$24^2,0.00001)","v":{"$error":"#VALUE!"}}]
[null,null,null,null,null,null,null,null,null,null,null,null,null,null,null,null,null,null,null,49,25.152344895298928,{"$f":"G('CB&P'!E$14,((-J$20)*'CB&P'!E$13/1440)*'CB&P'!U57/Data!V$24^2,0.00001)","v":{"$error":"#VALUE!"}}]
[null,null,null,null,null,null,null,null,null,null,null,null,null,null,null,null,null,null,null,50,26.2678510731274,{"$f":"G('CB&P'!E$14,((-J$20)*'CB&P'!E$13/1440)*'CB&P'!U58/Data!V$24^2,0.00001)","v":{"$error":"#VALUE!"}}]
[null,null,null,null,null,null,null,null,null,null,null,null,null,null,null,null,null,null,null,51,27.432829935826916,{"$f":"G('CB&P'!E$14,((-J$20)*'CB&P'!E$13/1440)*'CB&P'!U59/Data!V$24^2,0.00001)","v":{"$error":"#VALUE!"}}]
[null,null,null,null,null,null,null,null,null,null,null,null,null,null,null,null,null,null,null,52,28.649475596345521,{"$f":"G('CB&P'!E$14,((-J$20)*'CB&P'!E$13/1440)*'CB&P'!U60/Data!V$24^2,0.00001)","v":{"$error":"#VALUE!"}}]
[null,null,null,null,null,null,null,null,null,null,null,null,null,null,null,null,null,null,null,53,29.920079476512655,{"$f":"G('CB&P'!E$14,((-J$20)*'CB&P'!E$13/1440)*'CB&P'!U61/Data!V$24^2,0.00001)","v":{"$error":"#VALUE!"}}]
[null,null,null,null,null,null,null,null,null,null,null,null,null,null,null,null,null,null,null,54,31.247034622686964,{"$f":"G('CB&P'!E$14,((-J$20)*'CB&P'!E$13/1440)*'CB&P'!U62/Data!V$24^2,0.00001)","v":{"$error":"#VALUE!"}}]
[null,null,null,null,null,null,null,null,null,null,null,null,null,null,null,null,null,null,null,55,32.632840212802826,{"$f":"G('CB&P'!E$14,((-J$20)*'CB&P'!E$13/1440)*'CB&P'!U63/Data!V$24^2,0.00001)","v":{"$error":"#VALUE!"}}]
[null,null,null,null,null,null,null,null,null,null,null,null,null,null,null,null,null,null,null,56,34.080106263304302,{"$f":"G('CB&P'!E$14,((-J$20)*'CB&P'!E$13/1440)*'CB&P'!U64/Data!V$24^2,0.00001)","v":{"$error":"#VALUE!"}}]
[null,null,null,null,null,null,null,null,null,null,null,null,null,null,null,null,null,null,null,57,35.591558544831827,{"$f":"G('CB&P'!E$14,((-J$20)*'CB&P'!E$13/1440)*'CB&P'!U65/Data!V$24^2,0.00001)","v":{"$error":"#VALUE!"}}]
[null,null,null,null,null,null,null,null,null,null,null,null,null,null,null,null,null,null,null,58,37.170043715919128,{"$f":"G('CB&P'!E$14,((-J$20)*'CB&P'!E$13/1440)*'CB&P'!U66/Data!V$24^2,0.00001)","v":{"$error":"#VALUE!"}}]
[null,null,null,null,null,null,null,null,null,null,null,null,null,null,null,null,null,null,null,59,38.818534684369986,{"$f":"G('CB&P'!E$14,((-J$20)*'CB&P'!E$13/1440)*'CB&P'!U67/Data!V$24^2,0.00001)","v":{"$error":"#VALUE!"}}]
[null,null,null,null,null,null,null,null,null,null,null,null,null,null,null,null,null,null,null,60,40.540136206411653,{"$f":"G('CB&P'!E$14,((-J$20)*'CB&P'!E$13/1440)*'CB&P'!U68/Data!V$24^2,0.00001)","v":{"$error":"#VALUE!"}}]
[null,null,null,null,null,null,null,null,null,null,null,null,null,null,null,null,null,null,null,61,42.338090734170663,{"$f":"G('CB&P'!E$14,((-J$20)*'CB&P'!E$13/1440)*'CB&P'!U69/Data!V$24^2,0.00001)","v":{"$error":"#VALUE!"}}]
[null,null,null,null,null,null,null,null,null,null,null,null,null,null,null,null,null,null,null,62,44.215784522484491,{"$f":"G('CB&P'!E$14,((-J$20)*'CB&P'!E$13/1440)*'CB&P'!U70/Data!V$24^2,0.00001)","v":{"$error":"#VALUE!"}}]
[null,null,null,null,null,null,null,null,null,null,null,null,null,null,null,null,null,null,null,63,46.176754006549636,{"$f":"G('CB&P'!E$14,((-J$20)*'CB&P'!E$13/1440)*'CB&P'!U71/Data!V$24^2,0.00001)","v":{"$error":"#VALUE!"}}]
[null,null,null,null,null,null,null,null,null,null,null,null,null,null,null,null,null,null,null,64,{"$f":"EXP(LN(J$15)+(LN(J$16)-LN(J$15))*T72/100)","v":48.224692462418943},{"$f":"G('CB&P'!E$14,((-J$20)*'CB&P'!E$13/1440)*'CB&P'!U72/Data!V$24^2,0.00001)","v":{"$error":"#VALUE!"}}]
[null,null,null,null,null,null,null,null,null,null,null,null,null,null,null,null,null,null,null,65,50.363456962891462,{"$f":"G('CB&P'!E$14,((-J$20)*'CB&P'!E$13/1440)*'CB&P'!U73/Data!V$24^2,0.00001)","v":{"$error":"#VALUE!"}}]
[null,null,null,null,null,null,null,null,null,null,null,null,null,null,null,null,null,null,null,66,52.597075641895941,{"$f":"G('CB&P'!E$14,((-J$20)*'CB&P'!E$13/1440)*'CB&P'!U74/Data!V$24^2,0.00001)","v":{"$error":"#VALUE!"}}]
[null,null,null,null,null,null,null,null,null,null,null,null,null,null,null,null,null,null,null,67,54.929755281050078,{"$f":"G('CB&P'!E$14,((-J$20)*'CB&P'!E$13/1440)*'CB&P'!U75/Data!V$24^2,0.00001)","v":{"$error":"#VALUE!"}}]
[null,null,null,null,null,null,null,null,null,null,null,null,null,null,null,null,null,null,null,68,57.365889232682903,{"$f":"G('CB&P'!E$14,((-J$20)*'CB&P'!E$13/1440)*'CB&P'!U76/Data!V$24^2,0.00001)","v":{"$error":"#VALUE!"}}]
[null,null,null,null,null,null,null,null,null,null,null,null,null,null,null,null,null,null,null,69,59.910065694243769,{"$f":"G('CB&P'!E$14,((-J$20)*'CB&P'!E$13/1440)*'CB&P'!U77/Data!V$24^2,0.00001)","v":{"$error":"#VALUE!"}}]
[null,null,null,null,null,null,null,null,null,null,null,null,null,null,null,null,null,null,null,70,62.567076349680882,{"$f":"G('CB&P'!E$14,((-J$20)*'CB&P'!E$13/1440)*'CB&P'!U78/Data!V$24^2,0.00001)","v":{"$error":"#VALUE!"}}]
[null,null,null,null,null,null,null,null,null,null,null,null,null,null,null,null,null,null,null,71,65.341925394064731,{"$f":"G('CB&P'!E$14,((-J$20)*'CB&P'!E$13/1440)*'CB&P'!U79/Data!V$24^2,0.00001)","v":{"$error":"#VALUE!"}}]
[null,null,null,null,null,null,null,null,null,null,null,null,null,null,null,null,null,null,null,72,68.239838958454101,{"$f":"G('CB&P'!E$14,((-J$20)*'CB&P'!E$13/1440)*'CB&P'!U80/Data!V$24^2,0.00001)","v":{"$error":"#VALUE!"}}]
[null,null,null,null,null,null,null,null,null,null,null,null,null,null,null,null,null,null,null,73,71.266274952753832,{"$f":"G('CB&P'!E$14,((-J$20)*'CB&P'!E$13/1440)*'CB&P'!U81/Data!V$24^2,0.00001)","v":{"$error":"#VALUE!"}}]
[null,null,null,null,null,null,null,null,null,null,null,null,null,null,null,null,null,null,null,74,74.426933345104217,{"$f":"G('CB&P'!E$14,((-J$20)*'CB&P'!E$13/1440)*'CB&P'!U82/Data!V$24^2,0.00001)","v":{"$error":"#VALUE!"}}]
[null,null,null,null,null,null,null,null,null,null,null,null,null,null,null,null,null,null,null,75,77.727766897160393,{"$f":"G('CB&P'!E$14,((-J$20)*'CB&P'!E$13/1440)*'CB&P'!U83/Data!V$24^2,0.00001)","v":{"$error":"#VALUE!"}}]
[null,null,null,null,null,null,null,null,null,null,null,null,null,null,null,null,null,null,null,76,81.174992375481409,{"$f":"G('CB&P'!E$14,((-J$20)*'CB&P'!E$13/1440)*'CB&P'!U84/Data!V$24^2,0.00001)","v":{"$error":"#VALUE!"}}]
[null,null,null,null,null,null,null,null,null,null,null,null,null,null,null,null,null,null,null,77,84.775102260144806,{"$f":"G('CB&P'!E$14,((-J$20)*'CB&P'!E$13/1440)*'CB&P'!U85/Data!V$24^2,0.00001)","v":{"$error":"#VALUE!"}}]
[null,null,null,null,null,null,null,null,null,null,null,null,null,null,null,null,null,null,null,78,88.534876972637122,{"$f":"G('CB&P'!E$14,((-J$20)*'CB&P'!E$13/1440)*'CB&P'!U86/Data!V$24^2,0.00001)","v":{"$error":"#VALUE!"}}]
[null,null,null,null,null,null,null,null,null,null,null,null,null,null,null,null,null,null,null,79,92.461397646052234,{"$f":"G('CB&P'!E$14,((-J$20)*'CB&P'!E$13/1440)*'CB&P'!U87/Data!V$24^2,0.00001)","v":{"$error":"#VALUE!"}}]
[null,null,null,null,null,null,null,null,null,null,null,null,null,null,null,null,null,null,null,80,96.562059461647166,{"$f":"G('CB&P'!E$14,((-J$20)*'CB&P'!E$13/1440)*'CB&P'!U88/Data!V$24^2,0.00001)","v":{"$error":"#VALUE!"}}]
[null,null,null,null,null,null,null,null,null,null,null,null,null,null,null,null,null,null,null,81,100.84458557687381,{"$f":"G('CB&P'!E$14,((-J$20)*'CB&P'!E$13/1440)*'CB&P'!U89/Data!V$24^2,0.00001)","v":{"$error":"#VALUE!"}}]
[null,null,null,null,null,null,null,null,null,null,null,null,null,null,null,null,null,null,null,82,105.31704167111972,{"$f":"G('CB&P'!E$14,((-J$20)*'CB&P'!E$13/1440)*'CB&P'!U90/Data!V$24^2,0.00001)","v":{"$error":"#VALUE!"}}]
[null,null,null,null,null,null,null,null,null,null,null,null,null,null,null,null,null,null,null,83,109.98785113655084,{"$f":"G('CB&P'!E$14,((-J$20)*'CB&P'!E$13/1440)*'CB&P'!U91/Data!V$24^2,0.00001)","v":{"$error":"#VALUE!"}}]
[null,null,null,null,null,null,null,null,null,null,null,null,null,null,null,null,null,null,null,84,114.86581094266936,{"$f":"G('CB&P'!E$14,((-J$20)*'CB&P'!E$13/1440)*'CB&P'!U92/Data!V$24^2,0.00001)","v":{"$error":"#VALUE!"}}]
[null,null,null,null,null,null,null,null,null,null,null,null,null,null,null,null,null,null,null,85,119.96010820446357,{"$f":"G('CB&P'!E$14,((-J$20)*'CB&P'!E$13/1440)*'CB&P'!U93/Data!V$24^2,0.00001)","v":{"$error":"#VALUE!"}}]
[null,null,null,null,null,null,null,null,null,null,null,null,null,null,null,null,null,null,null,86,125.28033748535495,{"$f":"G('CB&P'!E$14,((-J$20)*'CB&P'!E$13/1440)*'CB&P'!U94/Data!V$24^2,0.00001)","v":{"$error":"#VALUE!"}}]
[null,null,null,null,null,null,null,null,null,null,null,null,null,null,null,null,null,null,null,87,130.83651886753174,{"$f":"G('CB&P'!E$14,((-J$20)*'CB&P'!E$13/1440)*'CB&P'!U95/Data!V$24^2,0.00001)","v":{"$error":"#VALUE!"}}]
[null,null,null,null,null,null,null,null,null,null,null,null,null,null,null,null,null,null,null,88,136.63911682369996,{"$f":"G('CB&P'!E$14,((-J$20)*'CB&P'!E$13/1440)*'CB&P'!U96/Data!V$24^2,0.00001)","v":{"$error":"#VALUE!"}}]
[null,null,null,null,null,null,null,null,null,null,null,null,null,null,null,null,null,null,null,89,142.69905992579814,{"$f":"G('CB&P'!E$14,((-J$20)*'CB&P'!E$13/1440)*'CB&P'!U97/Data!V$24^2,0.00001)","v":{"$error":"#VALUE!"}}]
[null,null,null,null,null,null,null,null,null,null,null,null,null,null,null,null,null,null,null,90,149.02776142779189,{"$f":"G('CB&P'!E$14,((-J$20)*'CB&P'!E$13/1440)*'CB&P'!U98/Data!V$24^2,0.00001)","v":{"$error":"#VALUE!"}}]
[null,null,null,null,null,null,null,null,null,null,null,null,null,null,null,null,null,null,null,91,155.63714076131546,{"$f":"G('CB&P'!E$14,((-J$20)*'CB&P'!E$13/1440)*'CB&P'!U99/Data!V$24^2,0.00001)","v":{"$error":"#VALUE!"}}]
[null,null,null,null,null,null,null,null,null,null,null,null,null,null,null,null,null,null,null,92,162.5396459846458,{"$f":"G('CB&P'!E$14,((-J$20)*'CB&P'!E$13/1440)*'CB&P'!U100/Data!V$24^2,0.00001)","v":{"$error":"#VALUE!"}}]
[null,null,null,null,null,null,null,null,null,null,null,null,null,null,null,null,null,null,null,93,169.74827722728631,{"$f":"G('CB&P'!E$14,((-J$20)*'CB&P'!E$13/1440)*'CB&P'!U101/Data!V$24^2,0.00001)","v":{"$error":"#VALUE!"}}]
[null,null,null,null,null,null,null,null,null,null,null,null,null,null,null,null,null,null,null,94,177.27661117431998,{"$f":"G('CB&P'!E$14,((-J$20)*'CB&P'!E$13/1440)*'CB&P'!U102/Data!V$24^2,0.00001)","v":{"$error":"#VALUE!"}}]
[null,null,null,null,null,null,null,null,null,null,null,null,null,null,null,null,null,null,null,95,185.1388266366408,{"$f":"G('CB&P'!E$14,((-J$20)*'CB&P'!E$13/1440)*'CB&P'!U103/Data!V$24^2,0.00001)","v":{"$error":"#VALUE!"}}]
[null,null,null,null,null,null,null,null,null,null,null,null,null,null,null,null,null,null,null,96,{"$f":"EXP(LN(J$15)+(LN(J$16)-LN(J$15))*T104/100)","v":193.349731255227},{"$f":"G('CB&P'!E$14,((-J$20)*'CB&P'!E$13/1440)*'CB&P'!U104/Data!V$24^2,0.00001)","v":{"$error":"#VALUE!"}}]
[null,null,null,null,null,null,null,null,null,null,null,null,null,null,null,null,null,null,null,97,201.92478938974679,{"$f":"G('CB&P'!E$14,((-J$20)*'CB&P'!E$13/1440)*'CB&P'!U105/Data!V$24^2,0.00001)","v":{"$error":"#VALUE!"}}]
[null,null,null,null,null,null,null,null,null,null,null,null,null,null,null,null,null,null,null,98,210.88015124402349,{"$f":"G('CB&P'!E$14,((-J$20)*'CB&P'!E$13/1440)*'CB&P'!U106/Data!V$24^2,0.00001)","v":{"$error":"#VALUE!"}}]
[null,null,null,null,null,null,null,null,null,null,null,null,null,null,null,null,null,null,null,99,220.23268328321629,{"$f":"G('CB&P'!E$14,((-J$20)*'CB&P'!E$13/1440)*'CB&P'!U107/Data!V$24^2,0.00001)","v":{"$error":"#VALUE!"}}]
[null,null,null,null,null,null,null,null,null,null,null,null,null,null,null,null,null,null,null,100,230.00000000000006,{"$f":"G('CB&P'!E$14,((-J$20)*'CB&P'!E$13/1440)*'CB&P'!U108/Data!V$24^2,0.00001)","v":{"$error":"#VALUE!"}}]

{"sheet":"B&R Type Curve","index":6,"n_rows":56,"n_cols":30,"rows_kept":56,"cut":false,"hidden":false,"merged":[[4,3,4,4]]}
["Bouwer and Rice Short Term LNAPL Mobility Test Type Curves"]
[{"$f":"CONCATENATE(\"B&R Type Curves:  Casing Rad. (ft) = \",Data!B6,\" ;  Borehole Rad. (ft) = \",Data!B7)","v":"B&R Type Curves:  Casing Rad. (ft) = 0.083 ;  Borehole Rad. (ft) = 0.167"}]
[]
[]
[null,null,null,"Enter these values"]
["Type Curve ID","Type Curve Name","Notes","Max Time (min)","Transmissivity (ft2/day)"]
[1,{"$f":"CONCATENATE(\"T=\",E7,\" ft2/day\")","v":"T=10 ft2/day"},null,150,10,null,"J-Ratio",null,null,null,"Type Curve 1",null,null,"Type Curve 2",null,null,"Type Curve 3",null,null,"Type Curve 4",null,null,"Type Curve 5",null,null,"Type Curve 6",null,null,"Type Curve 7"]
[2,"T=5 ft2/day",null,200,5,null,{"$f":"Figures!U27","v":{"$error":"#DIV/0!"}},"<--  If uncertain use",null,null,null,"T (ft2/day)",null,null,"T (ft2/day)",null,null,"T (ft2/day)",null,null,"T (ft2/day)",null,null,"T (ft2/day)",null,null,"T (ft2/day)",null,null,"T (ft2/day)"]
[3,"T=2 ft2/day",null,200,2,null,null,{"$f":"-(1-Data!B9)","v":-0.21999999999999997},null,null,null,{"$f":"E7","v":10},null,null,{"$f":"E8","v":5},null,null,{"$f":"E9","v":2},null,null,{"$f":"E10","v":1},null,null,{"$f":"E11","v":0.5},null,null,{"$f":"E12","v":0.2},null,null,{"$f":"E13","v":0.1}]
[4,"T=1 ft2/day",null,200,1]
[5,"T=0.5 ft2/day",null,200,0.5,null,null,null,null,null,"t (min)","s(t)/s0",null,"t (min)","s(t)/s0",null,"t (min)","s(t)/s0",null,"t (min)","s(t)/s0",null,"t (min)","s(t)/s0",null,"t (min)","s(t)/s0",null,"t (min)","s(t)/s0"]
[6,"T=0.2 ft2/day",null,200,0.2,null,null,null,null,null,0,{"$f":"EXP(-(2*L$9*(K12/1440)*(-G$8)/(Data!B$13^2*LN('B&R'!$J$12))))","v":{"$error":"#DIV/0!"}},null,0,{"$f":"EXP(-(2*O$9*(N12/1440)*(-G$8))/(Data!B$13^2*LN('B&R'!$J$12)))","v":{"$error":"#DIV/0!"}},null,0,{"$f":"EXP(-(2*R$9*(Q12/1440)*(-G$8))/(Data!B$13^2*LN('B&R'!$J$12)))","v":{"$error":"#DIV/0!"}},null,0,{"$f":"EXP(-(2*U$9*(T12/1440)*(-G$8))/(Data!B$13^2*LN('B&R'!J$12)))","v":{"$error":"#DIV/0!"}},null,0,{"$f":"EXP(-(2*X$9*(W12/1440)*(-G$8))/(Data!B$13^2*LN('B&R'!$J$12)))","v":{"$error":"#DIV/0!"}},null,0,{"$f":"EXP(-(2*AA$9*(Z12/1440)*(-G$8))/(Data!B$13^2*LN('B&R'!$J$12)))","v":{"$error":"#DIV/0!"}},null,0,{"$f":"EXP(-(2*AD$9*(AC12/1440)*(-G$8))/(Data!B$13^2*LN('B&R'!$J$12)))","v":{"$error":"#DIV/0!"}}]
[7,"T=0.1 ft2/day",null,200,0.1,null,null,null,null,null,{"$f":"(K$42-K$12)/30+K12","v":5},{"$f":"EXP(-(2*L$9*(K13/1440)*(-G$8)/(Data!B$13^2*LN('B&R'!$J$12))))","v":{"$error":"#DIV/0!"}},null,{"$f":"(N$42-N$12)/30+N12","v":6.666666666666667},{"$f":"EXP(-(2*O$9*(N13/1440)*(-G$8))/(Data!B$13^2*LN('B&R'!$J$12)))","v":{"$error":"#DIV/0!"}},null,{"$f":"(Q$42-Q$12)/30+Q12","v":6.666666666666667},{"$f":"EXP(-(2*R$9*(Q13/1440)*(-G$8))/(Data!B$13^2*LN('B&R'!$J$12)))","v":{"$error":"#DIV/0!"}},null,{"$f":"(T$42-T$12)/30+T12","v":6.666666666666667},{"$f":"EXP(-(2*U$9*(T13/1440)*(-G$8))/(Data!B$13^2*LN('B&R'!J$12)))","v":{"$error":"#DIV/0!"}},null,{"$f":"(W$42-W$12)/30+W12","v":6.666666666666667},{"$f":"EXP(-(2*X$9*(W13/1440)*(-G$8))/(Data!B$13^2*LN('B&R'!$J$12)))","v":{"$error":"#DIV/0!"}},null,{"$f":"(Z$42-Z$12)/30+Z12","v":6.666666666666667},{"$f":"EXP(-(2*AA$9*(Z13/1440)*(-G$8))/(Data!B$13^2*LN('B&R'!$J$12)))","v":{"$error":"#DIV/0!"}},null,{"$f":"(AC$42-AC$12)/30+AC12","v":6.666666666666667},{"$f":"EXP(-(2*AD$9*(AC13/1440)*(-G$8))/(Data!B$13^2*LN('B&R'!$J$12)))","v":{"$error":"#DIV/0!"}}]
[null,null,null,null,null,null,null,null,null,null,10,{"$f":"EXP(-(2*L$9*(K14/1440)*(-G$8)/(Data!B$13^2*LN('B&R'!$J$12))))","v":{"$error":"#DIV/0!"}},null,13.333333333333334,{"$f":"EXP(-(2*O$9*(N14/1440)*(-G$8))/(Data!B$13^2*LN('B&R'!$J$12)))","v":{"$error":"#DIV/0!"}},null,13.333333333333334,{"$f":"EXP(-(2*R$9*(Q14/1440)*(-G$8))/(Data!B$13^2*LN('B&R'!$J$12)))","v":{"$error":"#DIV/0!"}},null,13.333333333333334,{"$f":"EXP(-(2*U$9*(T14/1440)*(-G$8))/(Data!B$13^2*LN('B&R'!J$12)))","v":{"$error":"#DIV/0!"}},null,13.333333333333334,{"$f":"EXP(-(2*X$9*(W14/1440)*(-G$8))/(Data!B$13^2*LN('B&R'!$J$12)))","v":{"$error":"#DIV/0!"}},null,13.333333333333334,{"$f":"EXP(-(2*AA$9*(Z14/1440)*(-G$8))/(Data!B$13^2*LN('B&R'!$J$12)))","v":{"$error":"#DIV/0!"}},null,13.333333333333334,{"$f":"EXP(-(2*AD$9*(AC14/1440)*(-G$8))/(Data!B$13^2*LN('B&R'!$J$12)))","v":{"$error":"#DIV/0!"}}]
[null,null,null,null,null,null,null,null,null,null,15,{"$f":"EXP(-(2*L$9*(K15/1440)*(-G$8)/(Data!B$13^2*LN('B&R'!$J$12))))","v":{"$error":"#DIV/0!"}},null,20,{"$f":"EXP(-(2*O$9*(N15/1440)*(-G$8))/(Data!B$13^2*LN('B&R'!$J$12)))","v":{"$error":"#DIV/0!"}},null,20,{"$f":"EXP(-(2*R$9*(Q15/1440)*(-G$8))/(Data!B$13^2*LN('B&R'!$J$12)))","v":{"$error":"#DIV/0!"}},null,20,{"$f":"EXP(-(2*U$9*(T15/1440)*(-G$8))/(Data!B$13^2*LN('B&R'!J$12)))","v":{"$error":"#DIV/0!"}},null,20,{"$f":"EXP(-(2*X$9*(W15/1440)*(-G$8))/(Data!B$13^2*LN('B&R'!$J$12)))","v":{"$error":"#DIV/0!"}},null,20,{"$f":"EXP(-(2*AA$9*(Z15/1440)*(-G$8))/(Data!B$13^2*LN('B&R'!$J$12)))","v":{"$error":"#DIV/0!"}},null,20,{"$f":"EXP(-(2*AD$9*(AC15/1440)*(-G$8))/(Data!B$13^2*LN('B&R'!$J$12)))","v":{"$error":"#DIV/0!"}}]
[null,null,null,null,null,null,null,null,null,null,20,{"$f":"EXP(-(2*L$9*(K16/1440)*(-G$8)/(Data!B$13^2*LN('B&R'!$J$12))))","v":{"$error":"#DIV/0!"}},null,26.666666666666668,{"$f":"EXP(-(2*O$9*(N16/1440)*(-G$8))/(Data!B$13^2*LN('B&R'!$J$12)))","v":{"$error":"#DIV/0!"}},null,26.666666666666668,{"$f":"EXP(-(2*R$9*(Q16/1440)*(-G$8))/(Data!B$13^2*LN('B&R'!$J$12)))","v":{"$error":"#DIV/0!"}},null,26.666666666666668,{"$f":"EXP(-(2*U$9*(T16/1440)*(-G$8))/(Data!B$13^2*LN('B&R'!J$12)))","v":{"$error":"#DIV/0!"}},null,26.666666666666668,{"$f":"EXP(-(2*X$9*(W16/1440)*(-G$8))/(Data!B$13^2*LN('B&R'!$J$12)))","v":{"$error":"#DIV/0!"}},null,26.666666666666668,{"$f":"EXP(-(2*AA$9*(Z16/1440)*(-G$8))/(Data!B$13^2*LN('B&R'!$J$12)))","v":{"$error":"#DIV/0!"}},null,26.666666666666668,{"$f":"EXP(-(2*AD$9*(AC16/1440)*(-G$8))/(Data!B$13^2*LN('B&R'!$J$12)))","v":{"$error":"#DIV/0!"}}]
[null,null,null,null,null,null,null,null,null,null,25,{"$f":"EXP(-(2*L$9*(K17/1440)*(-G$8)/(Data!B$13^2*LN('B&R'!$J$12))))","v":{"$error":"#DIV/0!"}},null,33.333333333333336,{"$f":"EXP(-(2*O$9*(N17/1440)*(-G$8))/(Data!B$13^2*LN('B&R'!$J$12)))","v":{"$error":"#DIV/0!"}},null,33.333333333333336,{"$f":"EXP(-(2*R$9*(Q17/1440)*(-G$8))/(Data!B$13^2*LN('B&R'!$J$12)))","v":{"$error":"#DIV/0!"}},null,33.333333333333336,{"$f":"EXP(-(2*U$9*(T17/1440)*(-G$8))/(Data!B$13^2*LN('B&R'!J$12)))","v":{"$error":"#DIV/0!"}},null,33.333333333333336,{"$f":"EXP(-(2*X$9*(W17/1440)*(-G$8))/(Data!B$13^2*LN('B&R'!$J$12)))","v":{"$error":"#DIV/0!"}},null,33.333333333333336,{"$f":"EXP(-(2*AA$9*(Z17/1440)*(-G$8))/(Data!B$13^2*LN('B&R'!$J$12)))","v":{"$error":"#DIV/0!"}},null,33.333333333333336,{"$f":"EXP(-(2*AD$9*(AC17/1440)*(-G$8))/(Data!B$13^2*LN('B&R'!$J$12)))","v":{"$error":"#DIV/0!"}}]
[null,null,null,null,null,null,null,null,null,null,30,{"$f":"EXP(-(2*L$9*(K18/1440)*(-G$8)/(Data!B$13^2*LN('B&R'!$J$12))))","v":{"$error":"#DIV/0!"}},null,40,{"$f":"EXP(-(2*O$9*(N18/1440)*(-G$8))/(Data!B$13^2*LN('B&R'!$J$12)))","v":{"$error":"#DIV/0!"}},null,40,{"$f":"EXP(-(2*R$9*(Q18/1440)*(-G$8))/(Data!B$13^2*LN('B&R'!$J$12)))","v":{"$error":"#DIV/0!"}},null,40,{"$f":"EXP(-(2*U$9*(T18/1440)*(-G$8))/(Data!B$13^2*LN('B&R'!J$12)))","v":{"$error":"#DIV/0!"}},null,40,{"$f":"EXP(-(2*X$9*(W18/1440)*(-G$8))/(Data!B$13^2*LN('B&R'!$J$12)))","v":{"$error":"#DIV/0!"}},null,40,{"$f":"EXP(-(2*AA$9*(Z18/1440)*(-G$8))/(Data!B$13^2*LN('B&R'!$J$12)))","v":{"$error":"#DIV/0!"}},null,40,{"$f":"EXP(-(2*AD$9*(AC18/1440)*(-G$8))/(Data!B$13^2*LN('B&R'!$J$12)))","v":{"$error":"#DIV/0!"}}]
[null,null,null,null,null,null,null,null,null,null,35,{"$f":"EXP(-(2*L$9*(K19/1440)*(-G$8)/(Data!B$13^2*LN('B&R'!$J$12))))","v":{"$error":"#DIV/0!"}},null,46.666666666666664,{"$f":"EXP(-(2*O$9*(N19/1440)*(-G$8))/(Data!B$13^2*LN('B&R'!$J$12)))","v":{"$error":"#DIV/0!"}},null,46.666666666666664,{"$f":"EXP(-(2*R$9*(Q19/1440)*(-G$8))/(Data!B$13^2*LN('B&R'!$J$12)))","v":{"$error":"#DIV/0!"}},null,46.666666666666664,{"$f":"EXP(-(2*U$9*(T19/1440)*(-G$8))/(Data!B$13^2*LN('B&R'!J$12)))","v":{"$error":"#DIV/0!"}},null,46.666666666666664,{"$f":"EXP(-(2*X$9*(W19/1440)*(-G$8))/(Data!B$13^2*LN('B&R'!$J$12)))","v":{"$error":"#DIV/0!"}},null,46.666666666666664,{"$f":"EXP(-(2*AA$9*(Z19/1440)*(-G$8))/(Data!B$13^2*LN('B&R'!$J$12)))","v":{"$error":"#DIV/0!"}},null,46.666666666666664,{"$f":"EXP(-(2*AD$9*(AC19/1440)*(-G$8))/(Data!B$13^2*LN('B&R'!$J$12)))","v":{"$error":"#DIV/0!"}}]
[null,null,null,null,null,null,null,null,null,null,40,{"$f":"EXP(-(2*L$9*(K20/1440)*(-G$8)/(Data!B$13^2*LN('B&R'!$J$12))))","v":{"$error":"#DIV/0!"}},null,53.333333333333329,{"$f":"EXP(-(2*O$9*(N20/1440)*(-G$8))/(Data!B$13^2*LN('B&R'!$J$12)))","v":{"$error":"#DIV/0!"}},null,53.333333333333329,{"$f":"EXP(-(2*R$9*(Q20/1440)*(-G$8))/(Data!B$13^2*LN('B&R'!$J$12)))","v":{"$error":"#DIV/0!"}},null,53.333333333333329,{"$f":"EXP(-(2*U$9*(T20/1440)*(-G$8))/(Data!B$13^2*LN('B&R'!J$12)))","v":{"$error":"#DIV/0!"}},null,53.333333333333329,{"$f":"EXP(-(2*X$9*(W20/1440)*(-G$8))/(Data!B$13^2*LN('B&R'!$J$12)))","v":{"$error":"#DIV/0!"}},null,53.333333333333329,{"$f":"EXP(-(2*AA$9*(Z20/1440)*(-G$8))/(Data!B$13^2*LN('B&R'!$J$12)))","v":{"$error":"#DIV/0!"}},null,53.333333333333329,{"$f":"EXP(-(2*AD$9*(AC20/1440)*(-G$8))/(Data!B$13^2*LN('B&R'!$J$12)))","v":{"$error":"#DIV/0!"}}]
[null,null,null,null,null,null,null,null,null,null,45,{"$f":"EXP(-(2*L$9*(K21/1440)*(-G$8)/(Data!B$13^2*LN('B&R'!$J$12))))","v":{"$error":"#DIV/0!"}},null,59.999999999999993,{"$f":"EXP(-(2*O$9*(N21/1440)*(-G$8))/(Data!B$13^2*LN('B&R'!$J$12)))","v":{"$error":"#DIV/0!"}},null,59.999999999999993,{"$f":"EXP(-(2*R$9*(Q21/1440)*(-G$8))/(Data!B$13^2*LN('B&R'!$J$12)))","v":{"$error":"#DIV/0!"}},null,59.999999999999993,{"$f":"EXP(-(2*U$9*(T21/1440)*(-G$8))/(Data!B$13^2*LN('B&R'!J$12)))","v":{"$error":"#DIV/0!"}},null,59.999999999999993,{"$f":"EXP(-(2*X$9*(W21/1440)*(-G$8))/(Data!B$13^2*LN('B&R'!$J$12)))","v":{"$error":"#DIV/0!"}},null,59.999999999999993,{"$f":"EXP(-(2*AA$9*(Z21/1440)*(-G$8))/(Data!B$13^2*LN('B&R'!$J$12)))","v":{"$error":"#DIV/0!"}},null,59.999999999999993,{"$f":"EXP(-(2*AD$9*(AC21/1440)*(-G$8))/(Data!B$13^2*LN('B&R'!$J$12)))","v":{"$error":"#DIV/0!"}}]
[null,null,null,null,null,null,null,null,null,null,50,{"$f":"EXP(-(2*L$9*(K22/1440)*(-G$8)/(Data!B$13^2*LN('B&R'!$J$12))))","v":{"$error":"#DIV/0!"}},null,66.666666666666657,{"$f":"EXP(-(2*O$9*(N22/1440)*(-G$8))/(Data!B$13^2*LN('B&R'!$J$12)))","v":{"$error":"#DIV/0!"}},null,66.666666666666657,{"$f":"EXP(-(2*R$9*(Q22/1440)*(-G$8))/(Data!B$13^2*LN('B&R'!$J$12)))","v":{"$error":"#DIV/0!"}},null,66.666666666666657,{"$f":"EXP(-(2*U$9*(T22/1440)*(-G$8))/(Data!B$13^2*LN('B&R'!J$12)))","v":{"$error":"#DIV/0!"}},null,66.666666666666657,{"$f":"EXP(-(2*X$9*(W22/1440)*(-G$8))/(Data!B$13^2*LN('B&R'!$J$12)))","v":{"$error":"#DIV/0!"}},null,66.666666666666657,{"$f":"EXP(-(2*AA$9*(Z22/1440)*(-G$8))/(Data!B$13^2*LN('B&R'!$J$12)))","v":{"$error":"#DIV/0!"}},null,66.666666666666657,{"$f":"EXP(-(2*AD$9*(AC22/1440)*(-G$8))/(Data!B$13^2*LN('B&R'!$J$12)))","v":{"$error":"#DIV/0!"}}]
[null,null,null,null,null,null,null,null,null,null,55,{"$f":"EXP(-(2*L$9*(K23/1440)*(-G$8)/(Data!B$13^2*LN('B&R'!$J$12))))","v":{"$error":"#DIV/0!"}},null,73.333333333333329,{"$f":"EXP(-(2*O$9*(N23/1440)*(-G$8))/(Data!B$13^2*LN('B&R'!$J$12)))","v":{"$error":"#DIV/0!"}},null,73.333333333333329,{"$f":"EXP(-(2*R$9*(Q23/1440)*(-G$8))/(Data!B$13^2*LN('B&R'!$J$12)))","v":{"$error":"#DIV/0!"}},null,73.333333333333329,{"$f":"EXP(-(2*U$9*(T23/1440)*(-G$8))/(Data!B$13^2*LN('B&R'!J$12)))","v":{"$error":"#DIV/0!"}},null,73.333333333333329,{"$f":"EXP(-(2*X$9*(W23/1440)*(-G$8))/(Data!B$13^2*LN('B&R'!$J$12)))","v":{"$error":"#DIV/0!"}},null,73.333333333333329,{"$f":"EXP(-(2*AA$9*(Z23/1440)*(-G$8))/(Data!B$13^2*LN('B&R'!$J$12)))","v":{"$error":"#DIV/0!"}},null,73.333333333333329,{"$f":"EXP(-(2*AD$9*(AC23/1440)*(-G$8))/(Data!B$13^2*LN('B&R'!$J$12)))","v":{"$error":"#DIV/0!"}}]
[null,null,null,null,null,null,null,null,null,null,60,{"$f":"EXP(-(2*L$9*(K24/1440)*(-G$8)/(Data!B$13^2*LN('B&R'!$J$12))))","v":{"$error":"#DIV/0!"}},null,80,{"$f":"EXP(-(2*O$9*(N24/1440)*(-G$8))/(Data!B$13^2*LN('B&R'!$J$12)))","v":{"$error":"#DIV/0!"}},null,80,{"$f":"EXP(-(2*R$9*(Q24/1440)*(-G$8))/(Data!B$13^2*LN('B&R'!$J$12)))","v":{"$error":"#DIV/0!"}},null,80,{"$f":"EXP(-(2*U$9*(T24/1440)*(-G$8))/(Data!B$13^2*LN('B&R'!J$12)))","v":{"$error":"#DIV/0!"}},null,80,{"$f":"EXP(-(2*X$9*(W24/1440)*(-G$8))/(Data!B$13^2*LN('B&R'!$J$12)))","v":{"$error":"#DIV/0!"}},null,80,{"$f":"EXP(-(2*AA$9*(Z24/1440)*(-G$8))/(Data!B$13^2*LN('B&R'!$J$12)))","v":{"$error":"#DIV/0!"}},null,80,{"$f":"EXP(-(2*AD$9*(AC24/1440)*(-G$8))/(Data!B$13^2*LN('B&R'!$J$12)))","v":{"$error":"#DIV/0!"}}]
[null,null,null,null,null,null,null,null,null,null,65,{"$f":"EXP(-(2*L$9*(K25/1440)*(-G$8)/(Data!B$13^2*LN('B&R'!$J$12))))","v":{"$error":"#DIV/0!"}},null,86.666666666666671,{"$f":"EXP(-(2*O$9*(N25/1440)*(-G$8))/(Data!B$13^2*LN('B&R'!$J$12)))","v":{"$error":"#DIV/0!"}},null,86.666666666666671,{"$f":"EXP(-(2*R$9*(Q25/1440)*(-G$8))/(Data!B$13^2*LN('B&R'!$J$12)))","v":{"$error":"#DIV/0!"}},null,86.666666666666671,{"$f":"EXP(-(2*U$9*(T25/1440)*(-G$8))/(Data!B$13^2*LN('B&R'!J$12)))","v":{"$error":"#DIV/0!"}},null,86.666666666666671,{"$f":"EXP(-(2*X$9*(W25/1440)*(-G$8))/(Data!B$13^2*LN('B&R'!$J$12)))","v":{"$error":"#DIV/0!"}},null,86.666666666666671,{"$f":"EXP(-(2*AA$9*(Z25/1440)*(-G$8))/(Data!B$13^2*LN('B&R'!$J$12)))","v":{"$error":"#DIV/0!"}},null,86.666666666666671,{"$f":"EXP(-(2*AD$9*(AC25/1440)*(-G$8))/(Data!B$13^2*LN('B&R'!$J$12)))","v":{"$error":"#DIV/0!"}}]
[null,null,null,null,null,null,null,null,null,null,70,{"$f":"EXP(-(2*L$9*(K26/1440)*(-G$8)/(Data!B$13^2*LN('B&R'!$J$12))))","v":{"$error":"#DIV/0!"}},null,93.333333333333343,{"$f":"EXP(-(2*O$9*(N26/1440)*(-G$8))/(Data!B$13^2*LN('B&R'!$J$12)))","v":{"$error":"#DIV/0!"}},null,93.333333333333343,{"$f":"EXP(-(2*R$9*(Q26/1440)*(-G$8))/(Data!B$13^2*LN('B&R'!$J$12)))","v":{"$error":"#DIV/0!"}},null,93.333333333333343,{"$f":"EXP(-(2*U$9*(T26/1440)*(-G$8))/(Data!B$13^2*LN('B&R'!J$12)))","v":{"$error":"#DIV/0!"}},null,93.333333333333343,{"$f":"EXP(-(2*X$9*(W26/1440)*(-G$8))/(Data!B$13^2*LN('B&R'!$J$12)))","v":{"$error":"#DIV/0!"}},null,93.333333333333343,{"$f":"EXP(-(2*AA$9*(Z26/1440)*(-G$8))/(Data!B$13^2*LN('B&R'!$J$12)))","v":{"$error":"#DIV/0!"}},null,93.333333333333343,{"$f":"EXP(-(2*AD$9*(AC26/1440)*(-G$8))/(Data!B$13^2*LN('B&R'!$J$12)))","v":{"$error":"#DIV/0!"}}]
[null,null,null,null,null,null,null,null,null,null,75,{"$f":"EXP(-(2*L$9*(K27/1440)*(-G$8)/(Data!B$13^2*LN('B&R'!$J$12))))","v":{"$error":"#DIV/0!"}},null,100.00000000000001,{"$f":"EXP(-(2*O$9*(N27/1440)*(-G$8))/(Data!B$13^2*LN('B&R'!$J$12)))","v":{"$error":"#DIV/0!"}},null,100.00000000000001,{"$f":"EXP(-(2*R$9*(Q27/1440)*(-G$8))/(Data!B$13^2*LN('B&R'!$J$12)))","v":{"$error":"#DIV/0!"}},null,100.00000000000001,{"$f":"EXP(-(2*U$9*(T27/1440)*(-G$8))/(Data!B$13^2*LN('B&R'!J$12)))","v":{"$error":"#DIV/0!"}},null,100.00000000000001,{"$f":"EXP(-(2*X$9*(W27/1440)*(-G$8))/(Data!B$13^2*LN('B&R'!$J$12)))","v":{"$error":"#DIV/0!"}},null,100.00000000000001,{"$f":"EXP(-(2*AA$9*(Z27/1440)*(-G$8))/(Data!B$13^2*LN('B&R'!$J$12)))","v":{"$error":"#DIV/0!"}},null,100.00000000000001,{"$f":"EXP(-(2*AD$9*(AC27/1440)*(-G$8))/(Data!B$13^2*LN('B&R'!$J$12)))","v":{"$error":"#DIV/0!"}}]
[null,null,null,null,null,null,null,null,null,null,80,{"$f":"EXP(-(2*L$9*(K28/1440)*(-G$8)/(Data!B$13^2*LN('B&R'!$J$12))))","v":{"$error":"#DIV/0!"}},null,106.66666666666669,{"$f":"EXP(-(2*O$9*(N28/1440)*(-G$8))/(Data!B$13^2*LN('B&R'!$J$12)))","v":{"$error":"#DIV/0!"}},null,106.66666666666669,{"$f":"EXP(-(2*R$9*(Q28/1440)*(-G$8))/(Data!B$13^2*LN('B&R'!$J$12)))","v":{"$error":"#DIV/0!"}},null,106.66666666666669,{"$f":"EXP(-(2*U$9*(T28/1440)*(-G$8))/(Data!B$13^2*LN('B&R'!J$12)))","v":{"$error":"#DIV/0!"}},null,106.66666666666669,{"$f":"EXP(-(2*X$9*(W28/1440)*(-G$8))/(Data!B$13^2*LN('B&R'!$J$12)))","v":{"$error":"#DIV/0!"}},null,106.66666666666669,{"$f":"EXP(-(2*AA$9*(Z28/1440)*(-G$8))/(Data!B$13^2*LN('B&R'!$J$12)))","v":{"$error":"#DIV/0!"}},null,106.66666666666669,{"$f":"EXP(-(2*AD$9*(AC28/1440)*(-G$8))/(Data!B$13^2*LN('B&R'!$J$12)))","v":{"$error":"#DIV/0!"}}]
[null,null,null,null,null,null,null,null,null,null,85,{"$f":"EXP(-(2*L$9*(K29/1440)*(-G$8)/(Data!B$13^2*LN('B&R'!$J$12))))","v":{"$error":"#DIV/0!"}},null,113.33333333333336,{"$f":"EXP(-(2*O$9*(N29/1440)*(-G$8))/(Data!B$13^2*LN('B&R'!$J$12)))","v":{"$error":"#DIV/0!"}},null,113.33333333333336,{"$f":"EXP(-(2*R$9*(Q29/1440)*(-G$8))/(Data!B$13^2*LN('B&R'!$J$12)))","v":{"$error":"#DIV/0!"}},null,113.33333333333336,{"$f":"EXP(-(2*U$9*(T29/1440)*(-G$8))/(Data!B$13^2*LN('B&R'!J$12)))","v":{"$error":"#DIV/0!"}},null,113.33333333333336,{"$f":"EXP(-(2*X$9*(W29/1440)*(-G$8))/(Data!B$13^2*LN('B&R'!$J$12)))","v":{"$error":"#DIV/0!"}},null,113.33333333333336,{"$f":"EXP(-(2*AA$9*(Z29/1440)*(-G$8))/(Data!B$13^2*LN('B&R'!$J$12)))","v":{"$error":"#DIV/0!"}},null,113.33333333333336,{"$f":"EXP(-(2*AD$9*(AC29/1440)*(-G$8))/(Data!B$13^2*LN('B&R'!$J$12)))","v":{"$error":"#DIV/0!"}}]
[null,null,null,null,null,null,null,null,null,null,90,{"$f":"EXP(-(2*L$9*(K30/1440)*(-G$8)/(Data!B$13^2*LN('B&R'!$J$12))))","v":{"$error":"#DIV/0!"}},null,120.00000000000003,{"$f":"EXP(-(2*O$9*(N30/1440)*(-G$8))/(Data!B$13^2*LN('B&R'!$J$12)))","v":{"$error":"#DIV/0!"}},null,120.00000000000003,{"$f":"EXP(-(2*R$9*(Q30/1440)*(-G$8))/(Data!B$13^2*LN('B&R'!$J$12)))","v":{"$error":"#DIV/0!"}},null,120.00000000000003,{"$f":"EXP(-(2*U$9*(T30/1440)*(-G$8))/(Data!B$13^2*LN('B&R'!J$12)))","v":{"$error":"#DIV/0!"}},null,120.00000000000003,{"$f":"EXP(-(2*X$9*(W30/1440)*(-G$8))/(Data!B$13^2*LN('B&R'!$J$12)))","v":{"$error":"#DIV/0!"}},null,120.00000000000003,{"$f":"EXP(-(2*AA$9*(Z30/1440)*(-G$8))/(Data!B$13^2*LN('B&R'!$J$12)))","v":{"$error":"#DIV/0!"}},null,120.00000000000003,{"$f":"EXP(-(2*AD$9*(AC30/1440)*(-G$8))/(Data!B$13^2*LN('B&R'!$J$12)))","v":{"$error":"#DIV/0!"}}]
[null,null,null,null,null,null,null,null,null,null,95,{"$f":"EXP(-(2*L$9*(K31/1440)*(-G$8)/(Data!B$13^2*LN('B&R'!$J$12))))","v":{"$error":"#DIV/0!"}},null,126.6666666666667,{"$f":"EXP(-(2*O$9*(N31/1440)*(-G$8))/(Data!B$13^2*LN('B&R'!$J$12)))","v":{"$error":"#DIV/0!"}},null,126.6666666666667,{"$f":"EXP(-(2*R$9*(Q31/1440)*(-G$8))/(Data!B$13^2*LN('B&R'!$J$12)))","v":{"$error":"#DIV/0!"}},null,126.6666666666667,{"$f":"EXP(-(2*U$9*(T31/1440)*(-G$8))/(Data!B$13^2*LN('B&R'!J$12)))","v":{"$error":"#DIV/0!"}},null,126.6666666666667,{"$f":"EXP(-(2*X$9*(W31/1440)*(-G$8))/(Data!B$13^2*LN('B&R'!$J$12)))","v":{"$error":"#DIV/0!"}},null,126.6666666666667,{"$f":"EXP(-(2*AA$9*(Z31/1440)*(-G$8))/(Data!B$13^2*LN('B&R'!$J$12)))","v":{"$error":"#DIV/0!"}},null,126.6666666666667,{"$f":"EXP(-(2*AD$9*(AC31/1440)*(-G$8))/(Data!B$13^2*LN('B&R'!$J$12)))","v":{"$error":"#DIV/0!"}}]
[null,null,null,null,null,null,null,null,null,null,100,{"$f":"EXP(-(2*L$9*(K32/1440)*(-G$8)/(Data!B$13^2*LN('B&R'!$J$12))))","v":{"$error":"#DIV/0!"}},null,133.33333333333337,{"$f":"EXP(-(2*O$9*(N32/1440)*(-G$8))/(Data!B$13^2*LN('B&R'!$J$12)))","v":{"$error":"#DIV/0!"}},null,133.33333333333337,{"$f":"EXP(-(2*R$9*(Q32/1440)*(-G$8))/(Data!B$13^2*LN('B&R'!$J$12)))","v":{"$error":"#DIV/0!"}},null,133.33333333333337,{"$f":"EXP(-(2*U$9*(T32/1440)*(-G$8))/(Data!B$13^2*LN('B&R'!J$12)))","v":{"$error":"#DIV/0!"}},null,133.33333333333337,{"$f":"EXP(-(2*X$9*(W32/1440)*(-G$8))/(Data!B$13^2*LN('B&R'!$J$12)))","v":{"$error":"#DIV/0!"}},null,133.33333333333337,{"$f":"EXP(-(2*AA$9*(Z32/1440)*(-G$8))/(Data!B$13^2*LN('B&R'!$J$12)))","v":{"$error":"#DIV/0!"}},null,133.33333333333337,{"$f":"EXP(-(2*AD$9*(AC32/1440)*(-G$8))/(Data!B$13^2*LN('B&R'!$J$12)))","v":{"$error":"#DIV/0!"}}]
[null,null,null,null,null,null,null,null,null,null,105,{"$f":"EXP(-(2*L$9*(K33/1440)*(-G$8)/(Data!B$13^2*LN('B&R'!$J$12))))","v":{"$error":"#DIV/0!"}},null,140.00000000000003,{"$f":"EXP(-(2*O$9*(N33/1440)*(-G$8))/(Data!B$13^2*LN('B&R'!$J$12)))","v":{"$error":"#DIV/0!"}},null,140.00000000000003,{"$f":"EXP(-(2*R$9*(Q33/1440)*(-G$8))/(Data!B$13^2*LN('B&R'!$J$12)))","v":{"$error":"#DIV/0!"}},null,140.00000000000003,{"$f":"EXP(-(2*U$9*(T33/1440)*(-G$8))/(Data!B$13^2*LN('B&R'!J$12)))","v":{"$error":"#DIV/0!"}},null,140.00000000000003,{"$f":"EXP(-(2*X$9*(W33/1440)*(-G$8))/(Data!B$13^2*LN('B&R'!$J$12)))","v":{"$error":"#DIV/0!"}},null,140.00000000000003,{"$f":"EXP(-(2*AA$9*(Z33/1440)*(-G$8))/(Data!B$13^2*LN('B&R'!$J$12)))","v":{"$error":"#DIV/0!"}},null,140.00000000000003,{"$f":"EXP(-(2*AD$9*(AC33/1440)*(-G$8))/(Data!B$13^2*LN('B&R'!$J$12)))","v":{"$error":"#DIV/0!"}}]
[null,null,null,null,null,null,null,null,null,null,110,{"$f":"EXP(-(2*L$9*(K34/1440)*(-G$8)/(Data!B$13^2*LN('B&R'!$J$12))))","v":{"$error":"#DIV/0!"}},null,146.66666666666669,{"$f":"EXP(-(2*O$9*(N34/1440)*(-G$8))/(Data!B$13^2*LN('B&R'!$J$12)))","v":{"$error":"#DIV/0!"}},null,146.66666666666669,{"$f":"EXP(-(2*R$9*(Q34/1440)*(-G$8))/(Data!B$13^2*LN('B&R'!$J$12)))","v":{"$error":"#DIV/0!"}},null,146.66666666666669,{"$f":"EXP(-(2*U$9*(T34/1440)*(-G$8))/(Data!B$13^2*LN('B&R'!J$12)))","v":{"$error":"#DIV/0!"}},null,146.66666666666669,{"$f":"EXP(-(2*X$9*(W34/1440)*(-G$8))/(Data!B$13^2*LN('B&R'!$J$12)))","v":{"$error":"#DIV/0!"}},null,146.66666666666669,{"$f":"EXP(-(2*AA$9*(Z34/1440)*(-G$8))/(Data!B$13^2*LN('B&R'!$J$12)))","v":{"$error":"#DIV/0!"}},null,146.66666666666669,{"$f":"EXP(-(2*AD$9*(AC34/1440)*(-G$8))/(Data!B$13^2*LN('B&R'!$J$12)))","v":{"$error":"#DIV/0!"}}]
[null,null,null,null,null,null,null,null,null,null,115,{"$f":"EXP(-(2*L$9*(K35/1440)*(-G$8)/(Data!B$13^2*LN('B&R'!$J$12))))","v":{"$error":"#DIV/0!"}},null,153.33333333333334,{"$f":"EXP(-(2*O$9*(N35/1440)*(-G$8))/(Data!B$13^2*LN('B&R'!$J$12)))","v":{"$error":"#DIV/0!"}},null,153.33333333333334,{"$f":"EXP(-(2*R$9*(Q35/1440)*(-G$8))/(Data!B$13^2*LN('B&R'!$J$12)))","v":{"$error":"#DIV/0!"}},null,153.33333333333334,{"$f":"EXP(-(2*U$9*(T35/1440)*(-G$8))/(Data!B$13^2*LN('B&R'!J$12)))","v":{"$error":"#DIV/0!"}},null,153.33333333333334,{"$f":"EXP(-(2*X$9*(W35/1440)*(-G$8))/(Data!B$13^2*LN('B&R'!$J$12)))","v":{"$error":"#DIV/0!"}},null,153.33333333333334,{"$f":"EXP(-(2*AA$9*(Z35/1440)*(-G$8))/(Data!B$13^2*LN('B&R'!$J$12)))","v":{"$error":"#DIV/0!"}},null,153.33333333333334,{"$f":"EXP(-(2*AD$9*(AC35/1440)*(-G$8))/(Data!B$13^2*LN('B&R'!$J$12)))","v":{"$error":"#DIV/0!"}}]
[null,null,null,null,null,null,null,null,null,null,120,{"$f":"EXP(-(2*L$9*(K36/1440)*(-G$8)/(Data!B$13^2*LN('B&R'!$J$12))))","v":{"$error":"#DIV/0!"}},null,160,{"$f":"EXP(-(2*O$9*(N36/1440)*(-G$8))/(Data!B$13^2*LN('B&R'!$J$12)))","v":{"$error":"#DIV/0!"}},null,160,{"$f":"EXP(-(2*R$9*(Q36/1440)*(-G$8))/(Data!B$13^2*LN('B&R'!$J$12)))","v":{"$error":"#DIV/0!"}},null,160,{"$f":"EXP(-(2*U$9*(T36/1440)*(-G$8))/(Data!B$13^2*LN('B&R'!J$12)))","v":{"$error":"#DIV/0!"}},null,160,{"$f":"EXP(-(2*X$9*(W36/1440)*(-G$8))/(Data!B$13^2*LN('B&R'!$J$12)))","v":{"$error":"#DIV/0!"}},null,160,{"$f":"EXP(-(2*AA$9*(Z36/1440)*(-G$8))/(Data!B$13^2*LN('B&R'!$J$12)))","v":{"$error":"#DIV/0!"}},null,160,{"$f":"EXP(-(2*AD$9*(AC36/1440)*(-G$8))/(Data!B$13^2*LN('B&R'!$J$12)))","v":{"$error":"#DIV/0!"}}]
[null,null,null,null,null,null,null,null,null,null,125,{"$f":"EXP(-(2*L$9*(K37/1440)*(-G$8)/(Data!B$13^2*LN('B&R'!$J$12))))","v":{"$error":"#DIV/0!"}},null,166.66666666666666,{"$f":"EXP(-(2*O$9*(N37/1440)*(-G$8))/(Data!B$13^2*LN('B&R'!$J$12)))","v":{"$error":"#DIV/0!"}},null,166.66666666666666,{"$f":"EXP(-(2*R$9*(Q37/1440)*(-G$8))/(Data!B$13^2*LN('B&R'!$J$12)))","v":{"$error":"#DIV/0!"}},null,166.66666666666666,{"$f":"EXP(-(2*U$9*(T37/1440)*(-G$8))/(Data!B$13^2*LN('B&R'!J$12)))","v":{"$error":"#DIV/0!"}},null,166.66666666666666,{"$f":"EXP(-(2*X$9*(W37/1440)*(-G$8))/(Data!B$13^2*LN('B&R'!$J$12)))","v":{"$error":"#DIV/0!"}},null,166.66666666666666,{"$f":"EXP(-(2*AA$9*(Z37/1440)*(-G$8))/(Data!B$13^2*LN('B&R'!$J$12)))","v":{"$error":"#DIV/0!"}},null,166.66666666666666,{"$f":"EXP(-(2*AD$9*(AC37/1440)*(-G$8))/(Data!B$13^2*LN('B&R'!$J$12)))","v":{"$error":"#DIV/0!"}}]
[null,null,null,null,null,null,null,null,null,null,130,{"$f":"EXP(-(2*L$9*(K38/1440)*(-G$8)/(Data!B$13^2*LN('B&R'!$J$12))))","v":{"$error":"#DIV/0!"}},null,173.33333333333331,{"$f":"EXP(-(2*O$9*(N38/1440)*(-G$8))/(Data!B$13^2*LN('B&R'!$J$12)))","v":{"$error":"#DIV/0!"}},null,173.33333333333331,{"$f":"EXP(-(2*R$9*(Q38/1440)*(-G$8))/(Data!B$13^2*LN('B&R'!$J$12)))","v":{"$error":"#DIV/0!"}},null,173.33333333333331,{"$f":"EXP(-(2*U$9*(T38/1440)*(-G$8))/(Data!B$13^2*LN('B&R'!J$12)))","v":{"$error":"#DIV/0!"}},null,173.33333333333331,{"$f":"EXP(-(2*X$9*(W38/1440)*(-G$8))/(Data!B$13^2*LN('B&R'!$J$12)))","v":{"$error":"#DIV/0!"}},null,173.33333333333331,{"$f":"EXP(-(2*AA$9*(Z38/1440)*(-G$8))/(Data!B$13^2*LN('B&R'!$J$12)))","v":{"$error":"#DIV/0!"}},null,173.33333333333331,{"$f":"EXP(-(2*AD$9*(AC38/1440)*(-G$8))/(Data!B$13^2*LN('B&R'!$J$12)))","v":{"$error":"#DIV/0!"}}]
[null,null,null,null,null,null,null,null,null,null,135,{"$f":"EXP(-(2*L$9*(K39/1440)*(-G$8)/(Data!B$13^2*LN('B&R'!$J$12))))","v":{"$error":"#DIV/0!"}},null,179.99999999999997,{"$f":"EXP(-(2*O$9*(N39/1440)*(-G$8))/(Data!B$13^2*LN('B&R'!$J$12)))","v":{"$error":"#DIV/0!"}},null,179.99999999999997,{"$f":"EXP(-(2*R$9*(Q39/1440)*(-G$8))/(Data!B$13^2*LN('B&R'!$J$12)))","v":{"$error":"#DIV/0!"}},null,179.99999999999997,{"$f":"EXP(-(2*U$9*(T39/1440)*(-G$8))/(Data!B$13^2*LN('B&R'!J$12)))","v":{"$error":"#DIV/0!"}},null,179.99999999999997,{"$f":"EXP(-(2*X$9*(W39/1440)*(-G$8))/(Data!B$13^2*LN('B&R'!$J$12)))","v":{"$error":"#DIV/0!"}},null,179.99999999999997,{"$f":"EXP(-(2*AA$9*(Z39/1440)*(-G$8))/(Data!B$13^2*LN('B&R'!$J$12)))","v":{"$error":"#DIV/0!"}},null,179.99999999999997,{"$f":"EXP(-(2*AD$9*(AC39/1440)*(-G$8))/(Data!B$13^2*LN('B&R'!$J$12)))","v":{"$error":"#DIV/0!"}}]
[null,null,null,null,null,null,null,null,null,null,140,{"$f":"EXP(-(2*L$9*(K40/1440)*(-G$8)/(Data!B$13^2*LN('B&R'!$J$12))))","v":{"$error":"#DIV/0!"}},null,186.66666666666663,{"$f":"EXP(-(2*O$9*(N40/1440)*(-G$8))/(Data!B$13^2*LN('B&R'!$J$12)))","v":{"$error":"#DIV/0!"}},null,186.66666666666663,{"$f":"EXP(-(2*R$9*(Q40/1440)*(-G$8))/(Data!B$13^2*LN('B&R'!$J$12)))","v":{"$error":"#DIV/0!"}},null,186.66666666666663,{"$f":"EXP(-(2*U$9*(T40/1440)*(-G$8))/(Data!B$13^2*LN('B&R'!J$12)))","v":{"$error":"#DIV/0!"}},null,186.66666666666663,{"$f":"EXP(-(2*X$9*(W40/1440)*(-G$8))/(Data!B$13^2*LN('B&R'!$J$12)))","v":{"$error":"#DIV/0!"}},null,186.66666666666663,{"$f":"EXP(-(2*AA$9*(Z40/1440)*(-G$8))/(Data!B$13^2*LN('B&R'!$J$12)))","v":{"$error":"#DIV/0!"}},null,186.66666666666663,{"$f":"EXP(-(2*AD$9*(AC40/1440)*(-G$8))/(Data!B$13^2*LN('B&R'!$J$12)))","v":{"$error":"#DIV/0!"}}]
[null,null,null,null,null,null,null,null,null,null,145,{"$f":"EXP(-(2*L$9*(K41/1440)*(-G$8)/(Data!B$13^2*LN('B&R'!$J$12))))","v":{"$error":"#DIV/0!"}},null,193.33333333333329,{"$f":"EXP(-(2*O$9*(N41/1440)*(-G$8))/(Data!B$13^2*LN('B&R'!$J$12)))","v":{"$error":"#DIV/0!"}},null,193.33333333333329,{"$f":"EXP(-(2*R$9*(Q41/1440)*(-G$8))/(Data!B$13^2*LN('B&R'!$J$12)))","v":{"$error":"#DIV/0!"}},null,193.33333333333329,{"$f":"EXP(-(2*U$9*(T41/1440)*(-G$8))/(Data!B$13^2*LN('B&R'!J$12)))","v":{"$error":"#DIV/0!"}},null,193.33333333333329,{"$f":"EXP(-(2*X$9*(W41/1440)*(-G$8))/(Data!B$13^2*LN('B&R'!$J$12)))","v":{"$error":"#DIV/0!"}},null,193.33333333333329,{"$f":"EXP(-(2*AA$9*(Z41/1440)*(-G$8))/(Data!B$13^2*LN('B&R'!$J$12)))","v":{"$error":"#DIV/0!"}},null,193.33333333333329,{"$f":"EXP(-(2*AD$9*(AC41/1440)*(-G$8))/(Data!B$13^2*LN('B&R'!$J$12)))","v":{"$error":"#DIV/0!"}}]
[null,null,null,null,null,null,null,null,null,null,{"$f":"$D$7","v":150},{"$f":"EXP(-(2*L$9*(K42/1440)*(-G$8)/(Data!B$13^2*LN('B&R'!$J$12))))","v":{"$error":"#DIV/0!"}},null,{"$f":"$D$8","v":200},{"$f":"EXP(-(2*O$9*(N42/1440)*(-G$8))/(Data!B$13^2*LN('B&R'!$J$12)))","v":{"$error":"#DIV/0!"}},null,{"$f":"$D$9","v":200},{"$f":"EXP(-(2*R$9*(Q42/1440)*(-G$8))/(Data!B$13^2*LN('B&R'!$J$12)))","v":{"$error":"#DIV/0!"}},null,{"$f":"$D$10","v":200},{"$f":"EXP(-(2*U$9*(T42/1440)*(-G$8))/(Data!B$13^2*LN('B&R'!J$12)))","v":{"$error":"#DIV/0!"}},null,{"$f":"$D$11","v":200},{"$f":"EXP(-(2*X$9*(W42/1440)*(-G$8))/(Data!B$13^2*LN('B&R'!$J$12)))","v":{"$error":"#DIV/0!"}},null,{"$f":"$D$12","v":200},{"$f":"EXP(-(2*AA$9*(Z42/1440)*(-G$8))/(Data!B$13^2*LN('B&R'!$J$12)))","v":{"$error":"#DIV/0!"}},null,{"$f":"$D$13","v":200},{"$f":"EXP(-(2*AD$9*(AC42/1440)*(-G$8))/(Data!B$13^2*LN('B&R'!$J$12)))","v":{"$error":"#DIV/0!"}}]
[]
[]
[]
[]
[]
[]
["Field Data"]
[]
["Record Data in Fields Below",null,null,null,null,null,"Calculate and Plot Fields Below"]
["Well ID",null,"Well Dia. (ft)",null,"Total Depth (ft)"]
["Notes","Date","Time","Elapsed Time (min)","Depth To Product (TOC)","Depth to Water (TOC)","Product Thickness (ft)","Drawdown (s) DTP-DTP(initial) (ft)","Normalized Drawdown (s/sinitial)"]
["Initial Measurement"]
["Stopped Bailing/Start Gauging",null,null,0]
["Well Starts recovering"]

{"sheet":"Confined","index":7,"n_rows":19,"n_cols":13,"rows_kept":19,"cut":false,"hidden":true,"merged":[]}
["Confined LNAPL Model:",null,null,null,"Well Designation:",null,{"$f":"IF(Data!B1 > 0,Data!B1,\"\")","v":"MW16"}]
[null,null,null,null,"Date:",null,{"$f":"IF(Data!B2 > 0,Data!B2,\"\")","v":"2021-11-09"}]
[]
[]
["Depth to base of confining bed (ft bgs) [from boring log]:",24.27]
["Constant LNAPL discharge to well (ft3/d):",3.53]
[]
[]
[null,null,null,null,null,null,null,null,null,null,null,{"$f":"Data!N25","v":1.2099999999999795},{"$f":"B6","v":3.53}]
[null,null,null,null,null,null,null,null,null,null,null,{"$f":"B14","v":1.6330769230769258},{"$f":"M9","v":3.53}]
["Depth to top of screen (ft bgs):",{"$f":"Data!B10","v":30.7},null,null,null,null,null,null,null,null,null,0,0]
["Corrected water table elevation (ft bgs):",{"$f":"Data!I22","v":35.421400000000006}]
["Limiting effective LNAPL thickness in well, bnW (ft):",{"$f":"IF(B5>B11,(B5-B12)/Data!B9,(B11-B12)/Data!B9)","v":-6.0530769230769312}]
["Limiting effective LNAPL drawdown, snW (ft):",{"$f":"(1-Data!B9)*(Confined!B15-Confined!B13)","v":1.6330769230769258}]
["Initial LNAPL thickness, bnR (ft):",{"$f":"Data!O22","v":1.3700000000000045}]
["Radius of influence ratio (from Bouwer and Rice), R/rw:",{"$f":"'B&R'!J12","v":6.7405158957944886}]
[]
[]
["LNAPL Transmissivity, Tn (ft2/d):",{"$f":"B6*LN(B16)/(2*PI()*(1-Data!B9)*(B15-B13))","v":0.65644391380047684}]

{"sheet":"Perched","index":8,"n_rows":18,"n_cols":13,"rows_kept":18,"cut":false,"hidden":true,"merged":[]}
["Perched LNAPL Model:",null,null,null,"Well Designation:",null,{"$f":"IF(Data!B1 > 0,Data!B1,\"\")","v":"MW16"}]
[null,null,null,null,"Date:",null,{"$f":"IF(Data!B2 > 0,Data!B2,\"\")","v":"2021-11-09"}]
[]
[]
["Depth to top of perching layer, DZ12 (ft bgs):",22.63]
["Constant LNAPL discharge to well (ft3/d):",3.53]
[]
[]
[null,null,null,null,null,null,null,null,null,null,null,{"$f":"Data!N25","v":1.2099999999999795},{"$f":"B6","v":3.53}]
[null,null,null,null,null,null,null,null,null,null,null,{"$f":"B13","v":-12.490000000000006},{"$f":"M9","v":3.53}]
["Depth to top of screen (ft bgs):",{"$f":"Data!B10","v":30.7},null,null,null,null,null,null,null,null,null,0,0]
["Corrected water table elevation (ft bgs):",{"$f":"Data!I22","v":35.421400000000006}]
["Limiting effective LNAPL drawdown, snW (ft):",{"$f":"B5-B14","v":-12.490000000000006}]
["Initial depth to product (DTP0) (ft bgs):",{"$f":"Data!E22","v":35.120000000000005}]
["Radius of influence ratio (from Bouwer and Rice), R/rw:",{"$f":"'B&R'!J12","v":6.7405158957944886}]
[]
[]
["LNAPL Transmissivity, Tn (ft2/d):",{"$f":"B6*LN(B15)/(2*PI()*B13)","v":-8.5830536983335232E-2}]

{"sheet":"Flowchart","index":9,"n_rows":0,"n_cols":0,"rows_kept":0,"cut":false,"hidden":false,"merged":[]}